{"text_format":"2","workbook":"xlsx","n_sheets":4,"sheets":["PAIRING LIST","Deelnemers","Kontrollmatrix","Bron"],"not_rendered":{"charts":0,"images":0,"macros":0,"external_links":0,"defined_names":0,"comments":0,"pivot_tables":0},"unopened":[],"bounds":{"document_bytes":16777216,"sheet_cells":100000,"run_cost":"one","rows_first":2000,"rows_last":500,"rows_between":2000,"halvings":0,"cell_chars":16384,"cell_head_chars":4096},"cells_cut":0,"cells_raw":0,"read":"whole","date_system":"1900"}

{"sheet":"PAIRING LIST","index":0,"n_rows":76,"n_cols":8,"rows_kept":76,"cut":false,"hidden":false,"merged":[]}
["00:30:00"]
["Intended",{"$f":"Kontrollmatrix!A2","v":"Flight 1"}]
["Starttime","Race","Boot 1","Boot 2","Boot 3","Boot 4","Boot 5","Boot 6"]
["10:00:00",{"$f":"1+B1","v":1},{"$f":"VLOOKUP(Kontrollmatrix!B4,Deelnemers!$A$2:$C$19,2,FALSE)","v":"Team 11"},{"$f":"VLOOKUP(Kontrollmatrix!C4,Deelnemers!$A$2:$C$19,2,FALSE)","v":"Team 8"},{"$f":"VLOOKUP(Kontrollmatrix!D4,Deelnemers!$A$2:$C$19,2,FALSE)","v":"Team 13"},{"$f":"VLOOKUP(Kontrollmatrix!E4,Deelnemers!$A$2:$C$19,2,FALSE)","v":"Team 12"},{"$f":"VLOOKUP(Kontrollmatrix!F4,Deelnemers!$A$2:$C$19,2,FALSE)","v":"Team 15"},{"$f":"VLOOKUP(Kontrollmatrix!G4,Deelnemers!$A$2:$C$19,2,FALSE)","v":"Team 3"}]
[{"$f":"A4+$A$1","v":"10:30:00"},{"$f":"B4+1","v":2},{"$f":"VLOOKUP(Kontrollmatrix!B5,Deelnemers!$A$2:$C$19,2,FALSE)","v":"Team 2"},{"$f":"VLOOKUP(Kontrollmatrix!C5,Deelnemers!$A$2:$C$19,2,FALSE)","v":"Team 17"},{"$f":"VLOOKUP(Kontrollmatrix!D5,Deelnemers!$A$2:$C$19,2,FALSE)","v":"Team 1"},{"$f":"VLOOKUP(Kontrollmatrix!E5,Deelnemers!$A$2:$C$19,2,FALSE)","v":"Team 9"},{"$f":"VLOOKUP(Kontrollmatrix!F5,Deelnemers!$A$2:$C$19,2,FALSE)","v":"Team 4"},{"$f":"VLOOKUP(Kontrollmatrix!G5,Deelnemers!$A$2:$C$19,2,FALSE)","v":"Team 10"}]
["11:00:00",3,{"$f":"VLOOKUP(Kontrollmatrix!B6,Deelnemers!$A$2:$C$19,2,FALSE)","v":"Team 7"},{"$f":"VLOOKUP(Kontrollmatrix!C6,Deelnemers!$A$2:$C$19,2,FALSE)","v":"Team 6"},{"$f":"VLOOKUP(Kontrollmatrix!D6,Deelnemers!$A$2:$C$19,2,FALSE)","v":"Team 16"},{"$f":"VLOOKUP(Kontrollmatrix!E6,Deelnemers!$A$2:$C$19,2,FALSE)","v":"Team 14"},{"$f":"VLOOKUP(Kontrollmatrix!F6,Deelnemers!$A$2:$C$19,2,FALSE)","v":"Team 18"},{"$f":"VLOOKUP(Kontrollmatrix!G6,Deelnemers!$A$2:$C$19,2,FALSE)","v":"Team 5"}]
[null,{"$f":"Kontrollmatrix!A7","v":"Flight 2"}]
[null,"Race","Boot 1","Boot 2","Boot 3","Boot 4","Boot 5","Boot 6"]
[{"$f":"A6+$A$1","v":"11:30:00"},{"$f":"1+B6","v":4},{"$f":"VLOOKUP(Kontrollmatrix!B9,Deelnemers!$A$2:$C$19,2,FALSE)","v":"Team 7"},{"$f":"VLOOKUP(Kontrollmatrix!C9,Deelnemers!$A$2:$C$19,2,FALSE)","v":"Team 3"},{"$f":"VLOOKUP(Kontrollmatrix!D9,Deelnemers!$A$2:$C$19,2,FALSE)","v":"Team 2"},{"$f":"VLOOKUP(Kontrollmatrix!E9,Deelnemers!$A$2:$C$19,2,FALSE)","v":"Team 11"},{"$f":"VLOOKUP(Kontrollmatrix!F9,Deelnemers!$A$2:$C$19,2,FALSE)","v":"Team 18"},{"$f":"VLOOKUP(Kontrollmatrix!G9,Deelnemers!$A$2:$C$19,2,FALSE)","v":"Team 1"}]
[{"$f":"A9+$A$1","v":"12:00:00"},{"$f":"B9+1","v":5},{"$f":"VLOOKUP(Kontrollmatrix!B10,Deelnemers!$A$2:$C$19,2,FALSE)","v":"Team 12"},{"$f":"VLOOKUP(Kontrollmatrix!C10,Deelnemers!$A$2:$C$19,2,FALSE)","v":"Team 13"},{"$f":"VLOOKUP(Kontrollmatrix!D10,Deelnemers!$A$2:$C$19,2,FALSE)","v":"Team 14"},{"$f":"VLOOKUP(Kontrollmatrix!E10,Deelnemers!$A$2:$C$19,2,FALSE)","v":"Team 4"},{"$f":"VLOOKUP(Kontrollmatrix!F10,Deelnemers!$A$2:$C$19,2,FALSE)","v":"Team 9"},{"$f":"VLOOKUP(Kontrollmatrix!G10,Deelnemers!$A$2:$C$19,2,FALSE)","v":"Team 16"}]
["12:30:00",6,{"$f":"VLOOKUP(Kontrollmatrix!B11,Deelnemers!$A$2:$C$19,2,FALSE)","v":"Team 10"},{"$f":"VLOOKUP(Kontrollmatrix!C11,Deelnemers!$A$2:$C$19,2,FALSE)","v":"Team 5"},{"$f":"VLOOKUP(Kontrollmatrix!D11,Deelnemers!$A$2:$C$19,2,FALSE)","v":"Team 6"},{"$f":"VLOOKUP(Kontrollmatrix!E11,Deelnemers!$A$2:$C$19,2,FALSE)","v":"Team 17"},{"$f":"VLOOKUP(Kontrollmatrix!F11,Deelnemers!$A$2:$C$19,2,FALSE)","v":"Team 8"},{"$f":"VLOOKUP(Kontrollmatrix!G11,Deelnemers!$A$2:$C$19,2,FALSE)","v":"Team 15"}]
[null,{"$f":"Kontrollmatrix!A12","v":"Flight 3"}]
[null,"Race","Boot 1","Boot 2","Boot 3","Boot 4","Boot 5","Boot 6"]
[{"$f":"A11+$A$1","v":"13:00:00"},{"$f":"1+B11","v":7},{"$f":"VLOOKUP(Kontrollmatrix!B14,Deelnemers!$A$2:$C$19,2,FALSE)","v":"Team 13"},{"$f":"VLOOKUP(Kontrollmatrix!C14,Deelnemers!$A$2:$C$19,2,FALSE)","v":"Team 5"},{"$f":"VLOOKUP(Kontrollmatrix!D14,Deelnemers!$A$2:$C$19,2,FALSE)","v":"Team 6"},{"$f":"VLOOKUP(Kontrollmatrix!E14,Deelnemers!$A$2:$C$19,2,FALSE)","v":"Team 3"},{"$f":"VLOOKUP(Kontrollmatrix!F14,Deelnemers!$A$2:$C$19,2,FALSE)","v":"Team 2"},{"$f":"VLOOKUP(Kontrollmatrix!G14,Deelnemers!$A$2:$C$19,2,FALSE)","v":"Team 9"}]
[{"$f":"A14+$A$1","v":"13:30:00"},{"$f":"B14+1","v":8},{"$f":"VLOOKUP(Kontrollmatrix!B15,Deelnemers!$A$2:$C$19,2,FALSE)","v":"Team 11"},{"$f":"VLOOKUP(Kontrollmatrix!C15,Deelnemers!$A$2:$C$19,2,FALSE)","v":"Team 4"},{"$f":"VLOOKUP(Kontrollmatrix!D15,Deelnemers!$A$2:$C$19,2,FALSE)","v":"Team 15"},{"$f":"VLOOKUP(Kontrollmatrix!E15,Deelnemers!$A$2:$C$19,2,FALSE)","v":"Team 7"},{"$f":"VLOOKUP(Kontrollmatrix!F15,Deelnemers!$A$2:$C$19,2,FALSE)","v":"Team 14"},{"$f":"VLOOKUP(Kontrollmatrix!G15,Deelnemers!$A$2:$C$19,2,FALSE)","v":"Team 17"}]
["14:00:00",9,{"$f":"VLOOKUP(Kontrollmatrix!B16,Deelnemers!$A$2:$C$19,2,FALSE)","v":"Team 18"},{"$f":"VLOOKUP(Kontrollmatrix!C16,Deelnemers!$A$2:$C$19,2,FALSE)","v":"Team 12"},{"$f":"VLOOKUP(Kontrollmatrix!D16,Deelnemers!$A$2:$C$19,2,FALSE)","v":"Team 10"},{"$f":"VLOOKUP(Kontrollmatrix!E16,Deelnemers!$A$2:$C$19,2,FALSE)","v":"Team 8"},{"$f":"VLOOKUP(Kontrollmatrix!F16,Deelnemers!$A$2:$C$19,2,FALSE)","v":"Team 1"},{"$f":"VLOOKUP(Kontrollmatrix!G16,Deelnemers!$A$2:$C$19,2,FALSE)","v":"Team 16"}]
[null,{"$f":"Kontrollmatrix!A17","v":"Flight 4"}]
[null,"Race","Boot 1","Boot 2","Boot 3","Boot 4","Boot 5","Boot 6"]
[{"$f":"A16+$A$1","v":"14:30:00"},{"$f":"1+B16","v":10},{"$f":"VLOOKUP(Kontrollmatrix!B19,Deelnemers!$A$2:$C$19,2,FALSE)","v":"Team 7"},{"$f":"VLOOKUP(Kontrollmatrix!C19,Deelnemers!$A$2:$C$19,2,FALSE)","v":"Team 9"},{"$f":"VLOOKUP(Kontrollmatrix!D19,Deelnemers!$A$2:$C$19,2,FALSE)","v":"Team 17"},{"$f":"VLOOKUP(Kontrollmatrix!E19,Deelnemers!$A$2:$C$19,2,FALSE)","v":"Team 8"},{"$f":"VLOOKUP(Kontrollmatrix!F19,Deelnemers!$A$2:$C$19,2,FALSE)","v":"Team 3"},{"$f":"VLOOKUP(Kontrollmatrix!G19,Deelnemers!$A$2:$C$19,2,FALSE)","v":"Team 16"}]
[{"$f":"A19+$A$1","v":"15:00:00"},{"$f":"B19+1","v":11},{"$f":"VLOOKUP(Kontrollmatrix!B20,Deelnemers!$A$2:$C$19,2,FALSE)","v":"Team 18"},{"$f":"VLOOKUP(Kontrollmatrix!C20,Deelnemers!$A$2:$C$19,2,FALSE)","v":"Team 2"},{"$f":"VLOOKUP(Kontrollmatrix!D20,Deelnemers!$A$2:$C$19,2,FALSE)","v":"Team 4"},{"$f":"VLOOKUP(Kontrollmatrix!E20,Deelnemers!$A$2:$C$19,2,FALSE)","v":"Team 15"},{"$f":"VLOOKUP(Kontrollmatrix!F20,Deelnemers!$A$2:$C$19,2,FALSE)","v":"Team 13"},{"$f":"VLOOKUP(Kontrollmatrix!G20,Deelnemers!$A$2:$C$19,2,FALSE)","v":"Team 10"}]
["15:30:00",12,{"$f":"VLOOKUP(Kontrollmatrix!B21,Deelnemers!$A$2:$C$19,2,FALSE)","v":"Team 1"},{"$f":"VLOOKUP(Kontrollmatrix!C21,Deelnemers!$A$2:$C$19,2,FALSE)","v":"Team 6"},{"$f":"VLOOKUP(Kontrollmatrix!D21,Deelnemers!$A$2:$C$19,2,FALSE)","v":"Team 12"},{"$f":"VLOOKUP(Kontrollmatrix!E21,Deelnemers!$A$2:$C$19,2,FALSE)","v":"Team 5"},{"$f":"VLOOKUP(Kontrollmatrix!F21,Deelnemers!$A$2:$C$19,2,FALSE)","v":"Team 14"},{"$f":"VLOOKUP(Kontrollmatrix!G21,Deelnemers!$A$2:$C$19,2,FALSE)","v":"Team 11"}]
[null,{"$f":"Kontrollmatrix!A22","v":"Flight 5"}]
[null,"Race","Boot 1","Boot 2","Boot 3","Boot 4","Boot 5","Boot 6"]
[{"$f":"A21+$A$1","v":"16:00:00"},{"$f":"1+B21","v":13},{"$f":"VLOOKUP(Kontrollmatrix!B24,Deelnemers!$A$2:$C$19,2,FALSE)","v":"Team 9"},{"$f":"VLOOKUP(Kontrollmatrix!C24,Deelnemers!$A$2:$C$19,2,FALSE)","v":"Team 10"},{"$f":"VLOOKUP(Kontrollmatrix!D24,Deelnemers!$A$2:$C$19,2,FALSE)","v":"Team 3"},{"$f":"VLOOKUP(Kontrollmatrix!E24,Deelnemers!$A$2:$C$19,2,FALSE)","v":"Team 18"},{"$f":"VLOOKUP(Kontrollmatrix!F24,Deelnemers!$A$2:$C$19,2,FALSE)","v":"Team 14"},{"$f":"VLOOKUP(Kontrollmatrix!G24,Deelnemers!$A$2:$C$19,2,FALSE)","v":"Team 11"}]
[{"$f":"A24+$A$1","v":"16:30:00"},{"$f":"B24+1","v":14},{"$f":"VLOOKUP(Kontrollmatrix!B25,Deelnemers!$A$2:$C$19,2,FALSE)","v":"Team 8"},{"$f":"VLOOKUP(Kontrollmatrix!C25,Deelnemers!$A$2:$C$19,2,FALSE)","v":"Team 4"},{"$f":"VLOOKUP(Kontrollmatrix!D25,Deelnemers!$A$2:$C$19,2,FALSE)","v":"Team 7"},{"$f":"VLOOKUP(Kontrollmatrix!E25,Deelnemers!$A$2:$C$19,2,FALSE)","v":"Team 13"},{"$f":"VLOOKUP(Kontrollmatrix!F25,Deelnemers!$A$2:$C$19,2,FALSE)","v":"Team 6"},{"$f":"VLOOKUP(Kontrollmatrix!G25,Deelnemers!$A$2:$C$19,2,FALSE)","v":"Team 1"}]
["17:00:00",15,{"$f":"VLOOKUP(Kontrollmatrix!B26,Deelnemers!$A$2:$C$19,2,FALSE)","v":"Team 15"},{"$f":"VLOOKUP(Kontrollmatrix!C26,Deelnemers!$A$2:$C$19,2,FALSE)","v":"Team 16"},{"$f":"VLOOKUP(Kontrollmatrix!D26,Deelnemers!$A$2:$C$19,2,FALSE)","v":"Team 2"},{"$f":"VLOOKUP(Kontrollmatrix!E26,Deelnemers!$A$2:$C$19,2,FALSE)","v":"Team 17"},{"$f":"VLOOKUP(Kontrollmatrix!F26,Deelnemers!$A$2:$C$19,2,FALSE)","v":"Team 5"},{"$f":"VLOOKUP(Kontrollmatrix!G26,Deelnemers!$A$2:$C$19,2,FALSE)","v":"Team 12"}]
[null,{"$f":"Kontrollmatrix!A27","v":"Flight 6"}]
[null,"Race","Boot 1","Boot 2","Boot 3","Boot 4","Boot 5","Boot 6"]
[{"$f":"A4","v":"10:00:00"},{"$f":"1+B26","v":16},{"$f":"VLOOKUP(Kontrollmatrix!B29,Deelnemers!$A$2:$C$19,2,FALSE)","v":"Team 10"},{"$f":"VLOOKUP(Kontrollmatrix!C29,Deelnemers!$A$2:$C$19,2,FALSE)","v":"Team 4"},{"$f":"VLOOKUP(Kontrollmatrix!D29,Deelnemers!$A$2:$C$19,2,FALSE)","v":"Team 3"},{"$f":"VLOOKUP(Kontrollmatrix!E29,Deelnemers!$A$2:$C$19,2,FALSE)","v":"Team 7"},{"$f":"VLOOKUP(Kontrollmatrix!F29,Deelnemers!$A$2:$C$19,2,FALSE)","v":"Team 5"},{"$f":"VLOOKUP(Kontrollmatrix!G29,Deelnemers!$A$2:$C$19,2,FALSE)","v":"Team 12"}]
[{"$f":"A29+$A$1","v":"10:30:00"},{"$f":"B29+1","v":17},{"$f":"VLOOKUP(Kontrollmatrix!B30,Deelnemers!$A$2:$C$19,2,FALSE)","v":"Team 6"},{"$f":"VLOOKUP(Kontrollmatrix!C30,Deelnemers!$A$2:$C$19,2,FALSE)","v":"Team 11"},{"$f":"VLOOKUP(Kontrollmatrix!D30,Deelnemers!$A$2:$C$19,2,FALSE)","v":"Team 8"},{"$f":"VLOOKUP(Kontrollmatrix!E30,Deelnemers!$A$2:$C$19,2,FALSE)","v":"Team 2"},{"$f":"VLOOKUP(Kontrollmatrix!F30,Deelnemers!$A$2:$C$19,2,FALSE)","v":"Team 16"},{"$f":"VLOOKUP(Kontrollmatrix!G30,Deelnemers!$A$2:$C$19,2,FALSE)","v":"Team 9"}]
["11:00:00",18,{"$f":"VLOOKUP(Kontrollmatrix!B31,Deelnemers!$A$2:$C$19,2,FALSE)","v":"Team 17"},{"$f":"VLOOKUP(Kontrollmatrix!C31,Deelnemers!$A$2:$C$19,2,FALSE)","v":"Team 15"},{"$f":"VLOOKUP(Kontrollmatrix!D31,Deelnemers!$A$2:$C$19,2,FALSE)","v":"Team 14"},{"$f":"VLOOKUP(Kontrollmatrix!E31,Deelnemers!$A$2:$C$19,2,FALSE)","v":"Team 1"},{"$f":"VLOOKUP(Kontrollmatrix!F31,Deelnemers!$A$2:$C$19,2,FALSE)","v":"Team 18"},{"$f":"VLOOKUP(Kontrollmatrix!G31,Deelnemers!$A$2:$C$19,2,FALSE)","v":"Team 13"}]
[null,{"$f":"Kontrollmatrix!A32","v":"Flight 7"}]
[null,"Race","Boot 1","Boot 2","Boot 3","Boot 4","Boot 5","Boot 6"]
[{"$f":"A31+$A$1","v":"11:30:00"},{"$f":"1+B31","v":19},{"$f":"VLOOKUP(Kontrollmatrix!B34,Deelnemers!$A$2:$C$19,2,FALSE)","v":"Team 16"},{"$f":"VLOOKUP(Kontrollmatrix!C34,Deelnemers!$A$2:$C$19,2,FALSE)","v":"Team 15"},{"$f":"VLOOKUP(Kontrollmatrix!D34,Deelnemers!$A$2:$C$19,2,FALSE)","v":"Team 6"},{"$f":"VLOOKUP(Kontrollmatrix!E34,Deelnemers!$A$2:$C$19,2,FALSE)","v":"Team 1"},{"$f":"VLOOKUP(Kontrollmatrix!F34,Deelnemers!$A$2:$C$19,2,FALSE)","v":"Team 3"},{"$f":"VLOOKUP(Kontrollmatrix!G34,Deelnemers!$A$2:$C$19,2,FALSE)","v":"Team 4"}]
[{"$f":"A34+$A$1","v":"12:00:00"},{"$f":"B34+1","v":20},{"$f":"VLOOKUP(Kontrollmatrix!B35,Deelnemers!$A$2:$C$19,2,FALSE)","v":"Team 5"},{"$f":"VLOOKUP(Kontrollmatrix!C35,Deelnemers!$A$2:$C$19,2,FALSE)","v":"Team 17"},{"$f":"VLOOKUP(Kontrollmatrix!D35,Deelnemers!$A$2:$C$19,2,FALSE)","v":"Team 13"},{"$f":"VLOOKUP(Kontrollmatrix!E35,Deelnemers!$A$2:$C$19,2,FALSE)","v":"Team 11"},{"$f":"VLOOKUP(Kontrollmatrix!F35,Deelnemers!$A$2:$C$19,2,FALSE)","v":"Team 10"},{"$f":"VLOOKUP(Kontrollmatrix!G35,Deelnemers!$A$2:$C$19,2,FALSE)","v":"Team 7"}]
["12:30:00",21,{"$f":"VLOOKUP(Kontrollmatrix!B36,Deelnemers!$A$2:$C$19,2,FALSE)","v":"Team 12"},{"$f":"VLOOKUP(Kontrollmatrix!C36,Deelnemers!$A$2:$C$19,2,FALSE)","v":"Team 18"},{"$f":"VLOOKUP(Kontrollmatrix!D36,Deelnemers!$A$2:$C$19,2,FALSE)","v":"Team 9"},{"$f":"VLOOKUP(Kontrollmatrix!E36,Deelnemers!$A$2:$C$19,2,FALSE)","v":"Team 2"},{"$f":"VLOOKUP(Kontrollmatrix!F36,Deelnemers!$A$2:$C$19,2,FALSE)","v":"Team 8"},{"$f":"VLOOKUP(Kontrollmatrix!G36,Deelnemers!$A$2:$C$19,2,FALSE)","v":"Team 14"}]
[null,{"$f":"Kontrollmatrix!A37","v":"Flight 8"}]
[null,"Race","Boot 1","Boot 2","Boot 3","Boot 4","Boot 5","Boot 6"]
[{"$f":"A36+$A$1","v":"13:00:00"},{"$f":"1+B36","v":22},{"$f":"VLOOKUP(Kontrollmatrix!B39,Deelnemers!$A$2:$C$19,2,FALSE)","v":"Team 3"},{"$f":"VLOOKUP(Kontrollmatrix!C39,Deelnemers!$A$2:$C$19,2,FALSE)","v":"Team 18"},{"$f":"VLOOKUP(Kontrollmatrix!D39,Deelnemers!$A$2:$C$19,2,FALSE)","v":"Team 9"},{"$f":"VLOOKUP(Kontrollmatrix!E39,Deelnemers!$A$2:$C$19,2,FALSE)","v":"Team 6"},{"$f":"VLOOKUP(Kontrollmatrix!F39,Deelnemers!$A$2:$C$19,2,FALSE)","v":"Team 12"},{"$f":"VLOOKUP(Kontrollmatrix!G39,Deelnemers!$A$2:$C$19,2,FALSE)","v":"Team 4"}]
[{"$f":"A39+$A$1","v":"13:30:00"},{"$f":"B39+1","v":23},{"$f":"VLOOKUP(Kontrollmatrix!B40,Deelnemers!$A$2:$C$19,2,FALSE)","v":"Team 13"},{"$f":"VLOOKUP(Kontrollmatrix!C40,Deelnemers!$A$2:$C$19,2,FALSE)","v":"Team 1"},{"$f":"VLOOKUP(Kontrollmatrix!D40,Deelnemers!$A$2:$C$19,2,FALSE)","v":"Team 8"},{"$f":"VLOOKUP(Kontrollmatrix!E40,Deelnemers!$A$2:$C$19,2,FALSE)","v":"Team 14"},{"$f":"VLOOKUP(Kontrollmatrix!F40,Deelnemers!$A$2:$C$19,2,FALSE)","v":"Team 2"},{"$f":"VLOOKUP(Kontrollmatrix!G40,Deelnemers!$A$2:$C$19,2,FALSE)","v":"Team 5"}]
["14:00:00",24,{"$f":"VLOOKUP(Kontrollmatrix!B41,Deelnemers!$A$2:$C$19,2,FALSE)","v":"Team 16"},{"$f":"VLOOKUP(Kontrollmatrix!C41,Deelnemers!$A$2:$C$19,2,FALSE)","v":"Team 17"},{"$f":"VLOOKUP(Kontrollmatrix!D41,Deelnemers!$A$2:$C$19,2,FALSE)","v":"Team 15"},{"$f":"VLOOKUP(Kontrollmatrix!E41,Deelnemers!$A$2:$C$19,2,FALSE)","v":"Team 10"},{"$f":"VLOOKUP(Kontrollmatrix!F41,Deelnemers!$A$2:$C$19,2,FALSE)","v":"Team 7"},{"$f":"VLOOKUP(Kontrollmatrix!G41,Deelnemers!$A$2:$C$19,2,FALSE)","v":"Team 11"}]
[null,{"$f":"Kontrollmatrix!A42","v":"Flight 9"}]
[null,"Race","Boot 1","Boot 2","Boot 3","Boot 4","Boot 5","Boot 6"]
[{"$f":"A41+$A$1","v":"14:30:00"},{"$f":"1+B41","v":25},{"$f":"VLOOKUP(Kontrollmatrix!B44,Deelnemers!$A$2:$C$19,2,FALSE)","v":"Team 14"},{"$f":"VLOOKUP(Kontrollmatrix!C44,Deelnemers!$A$2:$C$19,2,FALSE)","v":"Team 8"},{"$f":"VLOOKUP(Kontrollmatrix!D44,Deelnemers!$A$2:$C$19,2,FALSE)","v":"Team 3"},{"$f":"VLOOKUP(Kontrollmatrix!E44,Deelnemers!$A$2:$C$19,2,FALSE)","v":"Team 10"},{"$f":"VLOOKUP(Kontrollmatrix!F44,Deelnemers!$A$2:$C$19,2,FALSE)","v":"Team 1"},{"$f":"VLOOKUP(Kontrollmatrix!G44,Deelnemers!$A$2:$C$19,2,FALSE)","v":"Team 2"}]
[{"$f":"A44+$A$1","v":"15:00:00"},{"$f":"B44+1","v":26},{"$f":"VLOOKUP(Kontrollmatrix!B45,Deelnemers!$A$2:$C$19,2,FALSE)","v":"Team 11"},{"$f":"VLOOKUP(Kontrollmatrix!C45,Deelnemers!$A$2:$C$19,2,FALSE)","v":"Team 4"},{"$f":"VLOOKUP(Kontrollmatrix!D45,Deelnemers!$A$2:$C$19,2,FALSE)","v":"Team 5"},{"$f":"VLOOKUP(Kontrollmatrix!E45,Deelnemers!$A$2:$C$19,2,FALSE)","v":"Team 18"},{"$f":"VLOOKUP(Kontrollmatrix!F45,Deelnemers!$A$2:$C$19,2,FALSE)","v":"Team 16"},{"$f":"VLOOKUP(Kontrollmatrix!G45,Deelnemers!$A$2:$C$19,2,FALSE)","v":"Team 13"}]
["15:30:00",27,{"$f":"VLOOKUP(Kontrollmatrix!B46,Deelnemers!$A$2:$C$19,2,FALSE)","v":"Team 6"},{"$f":"VLOOKUP(Kontrollmatrix!C46,Deelnemers!$A$2:$C$19,2,FALSE)","v":"Team 7"},{"$f":"VLOOKUP(Kontrollmatrix!D46,Deelnemers!$A$2:$C$19,2,FALSE)","v":"Team 17"},{"$f":"VLOOKUP(Kontrollmatrix!E46,Deelnemers!$A$2:$C$19,2,FALSE)","v":"Team 9"},{"$f":"VLOOKUP(Kontrollmatrix!F46,Deelnemers!$A$2:$C$19,2,FALSE)","v":"Team 15"},{"$f":"VLOOKUP(Kontrollmatrix!G46,Deelnemers!$A$2:$C$19,2,FALSE)","v":"Team 12"}]
[null,{"$f":"Kontrollmatrix!A47","v":"Flight 10"}]
[null,"Race","Boot 1","Boot 2","Boot 3","Boot 4","Boot 5","Boot 6"]
[{"$f":"A46+$A$1","v":"16:00:00"},{"$f":"1+B46","v":28},{"$f":"VLOOKUP(Kontrollmatrix!B49,Deelnemers!$A$2:$C$19,2,FALSE)","v":"Team 3"},{"$f":"VLOOKUP(Kontrollmatrix!C49,Deelnemers!$A$2:$C$19,2,FALSE)","v":"Team 13"},{"$f":"VLOOKUP(Kontrollmatrix!D49,Deelnemers!$A$2:$C$19,2,FALSE)","v":"Team 17"},{"$f":"VLOOKUP(Kontrollmatrix!E49,Deelnemers!$A$2:$C$19,2,FALSE)","v":"Team 16"},{"$f":"VLOOKUP(Kontrollmatrix!F49,Deelnemers!$A$2:$C$19,2,FALSE)","v":"Team 14"},{"$f":"VLOOKUP(Kontrollmatrix!G49,Deelnemers!$A$2:$C$19,2,FALSE)","v":"Team 10"}]
[{"$f":"A49+$A$1","v":"16:30:00"},{"$f":"B49+1","v":29},{"$f":"VLOOKUP(Kontrollmatrix!B50,Deelnemers!$A$2:$C$19,2,FALSE)","v":"Team 9"},{"$f":"VLOOKUP(Kontrollmatrix!C50,Deelnemers!$A$2:$C$19,2,FALSE)","v":"Team 15"},{"$f":"VLOOKUP(Kontrollmatrix!D50,Deelnemers!$A$2:$C$19,2,FALSE)","v":"Team 11"},{"$f":"VLOOKUP(Kontrollmatrix!E50,Deelnemers!$A$2:$C$19,2,FALSE)","v":"Team 5"},{"$f":"VLOOKUP(Kontrollmatrix!F50,Deelnemers!$A$2:$C$19,2,FALSE)","v":"Team 4"},{"$f":"VLOOKUP(Kontrollmatrix!G50,Deelnemers!$A$2:$C$19,2,FALSE)","v":"Team 8"}]
["17:00:00",30,{"$f":"VLOOKUP(Kontrollmatrix!B51,Deelnemers!$A$2:$C$19,2,FALSE)","v":"Team 6"},{"$f":"VLOOKUP(Kontrollmatrix!C51,Deelnemers!$A$2:$C$19,2,FALSE)","v":"Team 18"},{"$f":"VLOOKUP(Kontrollmatrix!D51,Deelnemers!$A$2:$C$19,2,FALSE)","v":"Team 7"},{"$f":"VLOOKUP(Kontrollmatrix!E51,Deelnemers!$A$2:$C$19,2,FALSE)","v":"Team 1"},{"$f":"VLOOKUP(Kontrollmatrix!F51,Deelnemers!$A$2:$C$19,2,FALSE)","v":"Team 2"},{"$f":"VLOOKUP(Kontrollmatrix!G51,Deelnemers!$A$2:$C$19,2,FALSE)","v":"Team 12"}]
[null,{"$f":"Kontrollmatrix!A52","v":"Flight 11"}]
[null,"Race","Boot 1","Boot 2","Boot 3","Boot 4","Boot 5","Boot 6"]
[{"$f":"A51+$A$1","v":"17:30:00"},{"$f":"1+B51","v":31},{"$f":"VLOOKUP(Kontrollmatrix!B54,Deelnemers!$A$2:$C$19,2,FALSE)","v":"Team 9"},{"$f":"VLOOKUP(Kontrollmatrix!C54,Deelnemers!$A$2:$C$19,2,FALSE)","v":"Team 3"},{"$f":"VLOOKUP(Kontrollmatrix!D54,Deelnemers!$A$2:$C$19,2,FALSE)","v":"Team 5"},{"$f":"VLOOKUP(Kontrollmatrix!E54,Deelnemers!$A$2:$C$19,2,FALSE)","v":"Team 1"},{"$f":"VLOOKUP(Kontrollmatrix!F54,Deelnemers!$A$2:$C$19,2,FALSE)","v":"Team 15"},{"$f":"VLOOKUP(Kontrollmatrix!G54,Deelnemers!$A$2:$C$19,2,FALSE)","v":"Team 14"}]
[{"$f":"A54+$A$1","v":"18:00:00"},{"$f":"B54+1","v":32},{"$f":"VLOOKUP(Kontrollmatrix!B55,Deelnemers!$A$2:$C$19,2,FALSE)","v":"Team 17"},{"$f":"VLOOKUP(Kontrollmatrix!C55,Deelnemers!$A$2:$C$19,2,FALSE)","v":"Team 8"},{"$f":"VLOOKUP(Kontrollmatrix!D55,Deelnemers!$A$2:$C$19,2,FALSE)","v":"Team 4"},{"$f":"VLOOKUP(Kontrollmatrix!E55,Deelnemers!$A$2:$C$19,2,FALSE)","v":"Team 18"},{"$f":"VLOOKUP(Kontrollmatrix!F55,Deelnemers!$A$2:$C$19,2,FALSE)","v":"Team 11"},{"$f":"VLOOKUP(Kontrollmatrix!G55,Deelnemers!$A$2:$C$19,2,FALSE)","v":"Team 6"}]
["18:30:00",33,{"$f":"VLOOKUP(Kontrollmatrix!B56,Deelnemers!$A$2:$C$19,2,FALSE)","v":"Team 12"},{"$f":"VLOOKUP(Kontrollmatrix!C56,Deelnemers!$A$2:$C$19,2,FALSE)","v":"Team 7"},{"$f":"VLOOKUP(Kontrollmatrix!D56,Deelnemers!$A$2:$C$19,2,FALSE)","v":"Team 10"},{"$f":"VLOOKUP(Kontrollmatrix!E56,Deelnemers!$A$2:$C$19,2,FALSE)","v":"Team 2"},{"$f":"VLOOKUP(Kontrollmatrix!F56,Deelnemers!$A$2:$C$19,2,FALSE)","v":"Team 16"},{"$f":"VLOOKUP(Kontrollmatrix!G56,Deelnemers!$A$2:$C$19,2,FALSE)","v":"Team 13"}]
[null,{"$f":"Kontrollmatrix!A57","v":"Flight 12"}]
[null,"Race","Boot 1","Boot 2","Boot 3","Boot 4","Boot 5","Boot 6"]
[{"$f":"A4","v":"10:00:00"},{"$f":"1+B56","v":34},{"$f":"VLOOKUP(Kontrollmatrix!B59,Deelnemers!$A$2:$C$19,2,FALSE)","v":"Team 12"},{"$f":"VLOOKUP(Kontrollmatrix!C59,Deelnemers!$A$2:$C$19,2,FALSE)","v":"Team 3"},{"$f":"VLOOKUP(Kontrollmatrix!D59,Deelnemers!$A$2:$C$19,2,FALSE)","v":"Team 17"},{"$f":"VLOOKUP(Kontrollmatrix!E59,Deelnemers!$A$2:$C$19,2,FALSE)","v":"Team 2"},{"$f":"VLOOKUP(Kontrollmatrix!F59,Deelnemers!$A$2:$C$19,2,FALSE)","v":"Team 11"},{"$f":"VLOOKUP(Kontrollmatrix!G59,Deelnemers!$A$2:$C$19,2,FALSE)","v":"Team 13"}]
[{"$f":"A59+$A$1","v":"10:30:00"},{"$f":"B59+1","v":35},{"$f":"VLOOKUP(Kontrollmatrix!B60,Deelnemers!$A$2:$C$19,2,FALSE)","v":"Team 7"},{"$f":"VLOOKUP(Kontrollmatrix!C60,Deelnemers!$A$2:$C$19,2,FALSE)","v":"Team 14"},{"$f":"VLOOKUP(Kontrollmatrix!D60,Deelnemers!$A$2:$C$19,2,FALSE)","v":"Team 8"},{"$f":"VLOOKUP(Kontrollmatrix!E60,Deelnemers!$A$2:$C$19,2,FALSE)","v":"Team 4"},{"$f":"VLOOKUP(Kontrollmatrix!F60,Deelnemers!$A$2:$C$19,2,FALSE)","v":"Team 10"},{"$f":"VLOOKUP(Kontrollmatrix!G60,Deelnemers!$A$2:$C$19,2,FALSE)","v":"Team 6"}]
["11:00:00",36,{"$f":"VLOOKUP(Kontrollmatrix!B61,Deelnemers!$A$2:$C$19,2,FALSE)","v":"Team 16"},{"$f":"VLOOKUP(Kontrollmatrix!C61,Deelnemers!$A$2:$C$19,2,FALSE)","v":"Team 5"},{"$f":"VLOOKUP(Kontrollmatrix!D61,Deelnemers!$A$2:$C$19,2,FALSE)","v":"Team 18"},{"$f":"VLOOKUP(Kontrollmatrix!E61,Deelnemers!$A$2:$C$19,2,FALSE)","v":"Team 9"},{"$f":"VLOOKUP(Kontrollmatrix!F61,Deelnemers!$A$2:$C$19,2,FALSE)","v":"Team 1"},{"$f":"VLOOKUP(Kontrollmatrix!G61,Deelnemers!$A$2:$C$19,2,FALSE)","v":"Team 15"}]
[null,{"$f":"Kontrollmatrix!A62","v":"Flight 13"}]
[null,"Race","Boot 1","Boot 2","Boot 3","Boot 4","Boot 5","Boot 6"]
[{"$f":"A61+$A$1","v":"11:30:00"},{"$f":"1+B61","v":37},{"$f":"VLOOKUP(Kontrollmatrix!B64,Deelnemers!$A$2:$C$19,2,FALSE)","v":"Team 16"},{"$f":"VLOOKUP(Kontrollmatrix!C64,Deelnemers!$A$2:$C$19,2,FALSE)","v":"Team 8"},{"$f":"VLOOKUP(Kontrollmatrix!D64,Deelnemers!$A$2:$C$19,2,FALSE)","v":"Team 11"},{"$f":"VLOOKUP(Kontrollmatrix!E64,Deelnemers!$A$2:$C$19,2,FALSE)","v":"Team 3"},{"$f":"VLOOKUP(Kontrollmatrix!F64,Deelnemers!$A$2:$C$19,2,FALSE)","v":"Team 1"},{"$f":"VLOOKUP(Kontrollmatrix!G64,Deelnemers!$A$2:$C$19,2,FALSE)","v":"Team 17"}]
[{"$f":"A64+$A$1","v":"12:00:00"},{"$f":"B64+1","v":38},{"$f":"VLOOKUP(Kontrollmatrix!B65,Deelnemers!$A$2:$C$19,2,FALSE)","v":"Team 15"},{"$f":"VLOOKUP(Kontrollmatrix!C65,Deelnemers!$A$2:$C$19,2,FALSE)","v":"Team 2"},{"$f":"VLOOKUP(Kontrollmatrix!D65,Deelnemers!$A$2:$C$19,2,FALSE)","v":"Team 14"},{"$f":"VLOOKUP(Kontrollmatrix!E65,Deelnemers!$A$2:$C$19,2,FALSE)","v":"Team 7"},{"$f":"VLOOKUP(Kontrollmatrix!F65,Deelnemers!$A$2:$C$19,2,FALSE)","v":"Team 4"},{"$f":"VLOOKUP(Kontrollmatrix!G65,Deelnemers!$A$2:$C$19,2,FALSE)","v":"Team 9"}]
["12:30:00",39,{"$f":"VLOOKUP(Kontrollmatrix!B66,Deelnemers!$A$2:$C$19,2,FALSE)","v":"Team 5"},{"$f":"VLOOKUP(Kontrollmatrix!C66,Deelnemers!$A$2:$C$19,2,FALSE)","v":"Team 6"},{"$f":"VLOOKUP(Kontrollmatrix!D66,Deelnemers!$A$2:$C$19,2,FALSE)","v":"Team 13"},{"$f":"VLOOKUP(Kontrollmatrix!E66,Deelnemers!$A$2:$C$19,2,FALSE)","v":"Team 10"},{"$f":"VLOOKUP(Kontrollmatrix!F66,Deelnemers!$A$2:$C$19,2,FALSE)","v":"Team 12"},{"$f":"VLOOKUP(Kontrollmatrix!G66,Deelnemers!$A$2:$C$19,2,FALSE)","v":"Team 18"}]
[null,{"$f":"Kontrollmatrix!A67","v":"Flight 14"}]
[null,"Race","Boot 1","Boot 2","Boot 3","Boot 4","Boot 5","Boot 6"]
[{"$f":"A66+$A$1","v":"13:00:00"},{"$f":"1+B66","v":40},{"$f":"VLOOKUP(Kontrollmatrix!B69,Deelnemers!$A$2:$C$19,2,FALSE)","v":"Team 3"},{"$f":"VLOOKUP(Kontrollmatrix!C69,Deelnemers!$A$2:$C$19,2,FALSE)","v":"Team 7"},{"$f":"VLOOKUP(Kontrollmatrix!D69,Deelnemers!$A$2:$C$19,2,FALSE)","v":"Team 13"},{"$f":"VLOOKUP(Kontrollmatrix!E69,Deelnemers!$A$2:$C$19,2,FALSE)","v":"Team 15"},{"$f":"VLOOKUP(Kontrollmatrix!F69,Deelnemers!$A$2:$C$19,2,FALSE)","v":"Team 8"},{"$f":"VLOOKUP(Kontrollmatrix!G69,Deelnemers!$A$2:$C$19,2,FALSE)","v":"Team 18"}]
[{"$f":"A69+$A$1","v":"13:30:00"},{"$f":"B69+1","v":41},{"$f":"VLOOKUP(Kontrollmatrix!B70,Deelnemers!$A$2:$C$19,2,FALSE)","v":"Team 1"},{"$f":"VLOOKUP(Kontrollmatrix!C70,Deelnemers!$A$2:$C$19,2,FALSE)","v":"Team 12"},{"$f":"VLOOKUP(Kontrollmatrix!D70,Deelnemers!$A$2:$C$19,2,FALSE)","v":"Team 11"},{"$f":"VLOOKUP(Kontrollmatrix!E70,Deelnemers!$A$2:$C$19,2,FALSE)","v":"Team 4"},{"$f":"VLOOKUP(Kontrollmatrix!F70,Deelnemers!$A$2:$C$19,2,FALSE)","v":"Team 10"},{"$f":"VLOOKUP(Kontrollmatrix!G70,Deelnemers!$A$2:$C$19,2,FALSE)","v":"Team 9"}]
["14:00:00",42,{"$f":"VLOOKUP(Kontrollmatrix!B71,Deelnemers!$A$2:$C$19,2,FALSE)","v":"Team 5"},{"$f":"VLOOKUP(Kontrollmatrix!C71,Deelnemers!$A$2:$C$19,2,FALSE)","v":"Team 14"},{"$f":"VLOOKUP(Kontrollmatrix!D71,Deelnemers!$A$2:$C$19,2,FALSE)","v":"Team 16"},{"$f":"VLOOKUP(Kontrollmatrix!E71,Deelnemers!$A$2:$C$19,2,FALSE)","v":"Team 6"},{"$f":"VLOOKUP(Kontrollmatrix!F71,Deelnemers!$A$2:$C$19,2,FALSE)","v":"Team 17"},{"$f":"VLOOKUP(Kontrollmatrix!G71,Deelnemers!$A$2:$C$19,2,FALSE)","v":"Team 2"}]
[null,{"$f":"Kontrollmatrix!A72","v":"Flight 15"}]
[null,"Race","Boot 1","Boot 2","Boot 3","Boot 4","Boot 5","Boot 6"]
[{"$f":"A71+$A$1","v":"14:30:00"},{"$f":"1+B71","v":43},{"$f":"VLOOKUP(Kontrollmatrix!B74,Deelnemers!$A$2:$C$19,2,FALSE)","v":"Team 15"},{"$f":"VLOOKUP(Kontrollmatrix!C74,Deelnemers!$A$2:$C$19,2,FALSE)","v":"Team 13"},{"$f":"VLOOKUP(Kontrollmatrix!D74,Deelnemers!$A$2:$C$19,2,FALSE)","v":"Team 9"},{"$f":"VLOOKUP(Kontrollmatrix!E74,Deelnemers!$A$2:$C$19,2,FALSE)","v":"Team 6"},{"$f":"VLOOKUP(Kontrollmatrix!F74,Deelnemers!$A$2:$C$19,2,FALSE)","v":"Team 10"},{"$f":"VLOOKUP(Kontrollmatrix!G74,Deelnemers!$A$2:$C$19,2,FALSE)","v":"Team 11"}]
[{"$f":"A74+$A$1","v":"15:00:00"},{"$f":"B74+1","v":44},{"$f":"VLOOKUP(Kontrollmatrix!B75,Deelnemers!$A$2:$C$19,2,FALSE)","v":"Team 4"},{"$f":"VLOOKUP(Kontrollmatrix!C75,Deelnemers!$A$2:$C$19,2,FALSE)","v":"Team 2"},{"$f":"VLOOKUP(Kontrollmatrix!D75,Deelnemers!$A$2:$C$19,2,FALSE)","v":"Team 16"},{"$f":"VLOOKUP(Kontrollmatrix!E75,Deelnemers!$A$2:$C$19,2,FALSE)","v":"Team 8"},{"$f":"VLOOKUP(Kontrollmatrix!F75,Deelnemers!$A$2:$C$19,2,FALSE)","v":"Team 5"},{"$f":"VLOOKUP(Kontrollmatrix!G75,Deelnemers!$A$2:$C$19,2,FALSE)","v":"Team 1"}]
["15:30:00",45,{"$f":"VLOOKUP(Kontrollmatrix!B76,Deelnemers!$A$2:$C$19,2,FALSE)","v":"Team 14"},{"$f":"VLOOKUP(Kontrollmatrix!C76,Deelnemers!$A$2:$C$19,2,FALSE)","v":"Team 18"},{"$f":"VLOOKUP(Kontrollmatrix!D76,Deelnemers!$A$2:$C$19,2,FALSE)","v":"Team 7"},{"$f":"VLOOKUP(Kontrollmatrix!E76,Deelnemers!$A$2:$C$19,2,FALSE)","v":"Team 17"},{"$f":"VLOOKUP(Kontrollmatrix!F76,Deelnemers!$A$2:$C$19,2,FALSE)","v":"Team 12"},{"$f":"VLOOKUP(Kontrollmatrix!G76,Deelnemers!$A$2:$C$19,2,FALSE)","v":"Team 3"}]

{"sheet":"Deelnemers","index":1,"n_rows":19,"n_cols":2,"rows_kept":19,"cut":false,"hidden":false,"merged":[]}
["ID","Name"]
[1.0,"Team 1"]
[2.0,"Team 2"]
[3.0,"Team 3"]
[4.0,"Team 4"]
[5.0,"Team 5"]
[6.0,"Team 6"]
[7.0,"Team 7"]
[8.0,"Team 8"]
[9.0,"Team 9"]
[10.0,"Team 10"]
[11.0,"Team 11"]
[12.0,"Team 12"]
[13.0,"Team 13"]
[14.0,"Team 14"]
[15.0,"Team 15"]
[16.0,"Team 16"]
[17.0,"Team 17"]
[18.0,"Team 18"]

{"sheet":"Kontrollmatrix","index":2,"n_rows":76,"n_cols":27,"rows_kept":76,"cut":false,"hidden":false,"merged":[]}
[{"$nulls":6},"Quelle der Pairings: Florian Haufe 09.05.2014",null,"Kontrollparameter"]
["Flight 1",{"$nulls":7},{"$f":"1-COUNTIF($J$9:$AA$26,0)/1830","v":1},"Effizienz der Pairings"]
[null,1.0,2.0,3.0,4.0,5.0,6.0,null,{"$f":"COUNT($J$9:$AA$26)-COUNTIF($J$9:$AA$26,0)","v":153},"1 zu 1 Begegnungen"]
["R1",{"$f":"VLOOKUP(VALUE(MID($A4,2,2)),Bron!$A$2:$G$46,B$3+1,FALSE)","v":11},{"$f":"VLOOKUP(VALUE(MID($A4,2,2)),Bron!$A$2:$G$46,C$3+1,FALSE)","v":8},{"$f":"VLOOKUP(VALUE(MID($A4,2,2)),Bron!$A$2:$G$46,D$3+1,FALSE)","v":13},{"$f":"VLOOKUP(VALUE(MID($A4,2,2)),Bron!$A$2:$G$46,E$3+1,FALSE)","v":12},{"$f":"VLOOKUP(VALUE(MID($A4,2,2)),Bron!$A$2:$G$46,F$3+1,FALSE)","v":15},{"$f":"VLOOKUP(VALUE(MID($A4,2,2)),Bron!$A$2:$G$46,G$3+1,FALSE)","v":3},{"$f":"TEXT(B4,\"00\")&\";\"&TEXT(C4,\"00\")&\";\"&TEXT(D4,\"00\")&\";\"&TEXT(E4,\"00\")&\";\"&TEXT(F4,\"00\")&\";\"&TEXT(G4,\"00\")","v":"11;08;13;12;15;03"},{"$f":"MIN($J$9:$AA$26)","v":3},"Min. Anzahl einer 1 zu 1 Begegnung"]
["R2",{"$f":"VLOOKUP(VALUE(MID($A5,2,2)),Bron!$A$2:$G$46,B$3+1,FALSE)","v":2},{"$f":"VLOOKUP(VALUE(MID($A5,2,2)),Bron!$A$2:$G$46,C$3+1,FALSE)","v":17},{"$f":"VLOOKUP(VALUE(MID($A5,2,2)),Bron!$A$2:$G$46,D$3+1,FALSE)","v":1},{"$f":"VLOOKUP(VALUE(MID($A5,2,2)),Bron!$A$2:$G$46,E$3+1,FALSE)","v":9},{"$f":"VLOOKUP(VALUE(MID($A5,2,2)),Bron!$A$2:$G$46,F$3+1,FALSE)","v":4},{"$f":"VLOOKUP(VALUE(MID($A5,2,2)),Bron!$A$2:$G$46,G$3+1,FALSE)","v":10},"02;17;01;09;04;10",{"$f":"MAX($J$9:$AA$26)","v":6},"Max. Anzahl einer 1 zu 1 Begegnung"]
["R3",{"$f":"VLOOKUP(VALUE(MID($A6,2,2)),Bron!$A$2:$G$46,B$3+1,FALSE)","v":7},{"$f":"VLOOKUP(VALUE(MID($A6,2,2)),Bron!$A$2:$G$46,C$3+1,FALSE)","v":6},{"$f":"VLOOKUP(VALUE(MID($A6,2,2)),Bron!$A$2:$G$46,D$3+1,FALSE)","v":16},{"$f":"VLOOKUP(VALUE(MID($A6,2,2)),Bron!$A$2:$G$46,E$3+1,FALSE)","v":14},{"$f":"VLOOKUP(VALUE(MID($A6,2,2)),Bron!$A$2:$G$46,F$3+1,FALSE)","v":18},{"$f":"VLOOKUP(VALUE(MID($A6,2,2)),Bron!$A$2:$G$46,G$3+1,FALSE)","v":5},"07;06;16;14;18;05",{"$f":"STDEVP(J9:AA26)","v":0.7882255389},"Standardabw."]
["Flight 2",{"$nulls":7},"Kontrollmatrix der 1 zu 1 Begegnungen"]
[null,1.0,2.0,3.0,4.0,5.0,6.0,null,"-","01","02","03","04","05","06","07","08","09","10","11","12","13","14","15","16","17","18"]
["R4",{"$f":"VLOOKUP(VALUE(MID($A9,2,2)),Bron!$A$2:$G$46,B$3+1,FALSE)","v":7},{"$f":"VLOOKUP(VALUE(MID($A9,2,2)),Bron!$A$2:$G$46,C$3+1,FALSE)","v":3},{"$f":"VLOOKUP(VALUE(MID($A9,2,2)),Bron!$A$2:$G$46,D$3+1,FALSE)","v":2},{"$f":"VLOOKUP(VALUE(MID($A9,2,2)),Bron!$A$2:$G$46,E$3+1,FALSE)","v":11},{"$f":"VLOOKUP(VALUE(MID($A9,2,2)),Bron!$A$2:$G$46,F$3+1,FALSE)","v":18},{"$f":"VLOOKUP(VALUE(MID($A9,2,2)),Bron!$A$2:$G$46,G$3+1,FALSE)","v":1},{"$f":"TEXT(B9,\"00\")&\";\"&TEXT(C9,\"00\")&\";\"&TEXT(D9,\"00\")&\";\"&TEXT(E9,\"00\")&\";\"&TEXT(F9,\"00\")&\";\"&TEXT(G9,\"00\")","v":"07;03;02;11;18;01"},"01",null,{"$f":"IF(AND(ISNUMBER(FIND(K$8,$H$4)),ISNUMBER(FIND($I9,$H$4))),1,0)+IF(AND(ISNUMBER(FIND(K$8,$H$5)),ISNUMBER(FIND($I9,$H$5))),1,0)+IF(AND(ISNUMBER(FIND(K$8,$H$6)),ISNUMBER(FIND($I9,$H$6))),1,0)+IF(AND(ISNUMBER(FIND(K$8,$H$7)),ISNUMBER(FIND($I9,$H$7))),1,0)+IF(AND(ISNUMBER(FIND(K$8,$H$8)),ISNUMBER(FIND($I9,$H$8))),1,0)+IF(AND(ISNUMBER(FIND(K$8,$H$9)),ISNUMBER(FIND($I9,$H$9))),1,0)+IF(AND(ISNUMBER(FIND(K$8,$H$10)),ISNUMBER(FIND($I9,$H$10))),1,0)+IF(AND(ISNUMBER(FIND(K$8,$H$11)),ISNUMBER(FIND($I9,$H$11))),1,0)+IF(AND(ISNUMBER(FIND(K$8,$H$12)),ISNUMBER(FIND($I9,$H$12))),1,0)+IF(AND(ISNUMBER(FIND(K$8,$H$13)),ISNUMBER(FIND($I9,$H$13))),1,0)+IF(AND(ISNUMBER(FIND(K$8,$H$14)),ISNUMBER(FIND($I9,$H$14))),1,0)+IF(AND(ISNUMBER(FIND(K$8,$H$15)),ISNUMBER(FIND($I9,$H$15))),1,0)+IF(AND(ISNUMBER(FIND(K$8,$H$16)),ISNUMBER(FIND($I9,$H$16))),1,0)+IF(AND(ISNUMBER(FIND(K$8,$H$17)),ISNUMBER(FIND($I9,$H$17))),1,0)+IF(AND(ISNUMBER(FIND(K$8,$H$18)),ISNUMBER(FIND($I9,$H$18))),1,0)+IF(AND(ISNUMBER(FIND(K$8,$H$19)),ISNUMBER(FIND($I9,$H$19))),1,0)+IF(AND(ISNUMBER(FIND(K$8,$H$20)),ISNUMBER(FIND($I9,$H$20))),1,0)+IF(AND(ISNUMBER(FIND(K$8,$H$21)),ISNUMBER(FIND($I9,$H$21))),1,0)+IF(AND(ISNUMBER(FIND(K$8,$H$22)),ISNUMBER(FIND($I9,$H$22))),1,0)+IF(AND(ISNUMBER(FIND(K$8,$H$23)),ISNUMBER(FIND($I9,$H$23))),1,0)+IF(AND(ISNUMBER(FIND(K$8,$H$24)),ISNUMBER(FIND($I9,$H$24))),1,0)+IF(AND(ISNUMBER(FIND(K$8,$H$25)),ISNUMBER(FIND($I9,$H$25))),1,0)+IF(AND(ISNUMBER(FIND(K$8,$H$26)),ISNUMBER(FIND($I9,$H$26))),1,0)+IF(AND(ISNUMBER(FIND(K$8,$H$27)),ISNUMBER(FIND($I9,$H$27))),1,0)+IF(AND(ISNUMBER(FIND(K$8,$H$28)),ISNUMBER(FIND($I9,$H$28))),1,0)+IF(AND(ISNUMBER(FIND(K$8,$H$29)),ISNUMBER(FIND($I9,$H$29))),1,0)+IF(AND(ISNUMBER(FIND(K$8,$H$30)),ISNUMBER(FIND($I9,$H$30))),1,0)+IF(AND(ISNUMBER(FIND(K$8,$H$31)),ISNUMBER(FIND($I9,$H$31))),1,0)+IF(AND(ISNUMBER(FIND(K$8,$H$32)),ISNUMBER(FIND($I9,$H$32))),1,0)+IF(AND(ISNUMBER(FIND(K$8,$H$33)),ISNUMBER(FIND($I9,$H$33))),1,0)+IF(AND(ISNUMBER(FIND(K$8,$H$34)),ISNUMBER(FIND($I9,$H$34))),1,0)+IF(AND(ISNUMBER(FIND(K$8,$H$35)),ISNUMBER(FIND($I9,$H$35))),1,0)+IF(AND(ISNUMBER(FIND(K$8,$H$36)),ISNUMBER(FIND($I9,$H$36))),1,0)+IF(AND(ISNUMBER(FIND(K$8,$H$37)),ISNUMBER(FIND($I9,$H$37))),1,0)+IF(AND(ISNUMBER(FIND(K$8,$H$38)),ISNUMBER(FIND($I9,$H$38))),1,0)+IF(AND(ISNUMBER(FIND(K$8,$H$39)),ISNUMBER(FIND($I9,$H$39))),1,0)+IF(AND(ISNUMBER(FIND(K$8,$H$40)),ISNUMBER(FIND($I9,$H$40))),1,0)+IF(AND(ISNUMBER(FIND(K$8,$H$41)),ISNUMBER(FIND($I9,$H$41))),1,0)+IF(AND(ISNUMBER(FIND(K$8,$H$42)),ISNUMBER(FIND($I9,$H$42))),1,0)+IF(AND(ISNUMBER(FIND(K$8,$H$43)),ISNUMBER(FIND($I9,$H$43))),1,0)+IF(AND(ISNUMBER(FIND(K$8,$H$44)),ISNUMBER(FIND($I9,$H$44))),1,0)+IF(AND(ISNUMBER(FIND(K$8,$H$45)),ISNUMBER(FIND($I9,$H$45))),1,0)+IF(AND(ISNUMBER(FIND(K$8,$H$46)),ISNUMBER(FIND($I9,$H$46))),1,0)+IF(AND(ISNUMBER(FIND(K$8,$H$47)),ISNUMBER(FIND($I9,$H$47))),1,0)+IF(AND(ISNUMBER(FIND(K$8,$H$48)),ISNUMBER(FIND($I9,$H$48))),1,0)+IF(AND(ISNUMBER(FIND(K$8,$H$49)),ISNUMBER(FIND($I9,$H$49))),1,0)+IF(AND(ISNUMBER(FIND(K$8,$H$50)),ISNUMBER(FIND($I9,$H$50))),1,0)+IF(AND(ISNUMBER(FIND(K$8,$H$51)),ISNUMBER(FIND($I9,$H$51))),1,0)+IF(AND(ISNUMBER(FIND(K$8,$H$52)),ISNUMBER(FIND($I9,$H$52))),1,0)+IF(AND(ISNUMBER(FIND(K$8,$H$53)),ISNUMBER(FIND($I9,$H$53))),1,0)+IF(AND(ISNUMBER(FIND(K$8,$H$54)),ISNUMBER(FIND($I9,$H$54))),1,0)+IF(AND(ISNUMBER(FIND(K$8,$H$55)),ISNUMBER(FIND($I9,$H$55))),1,0)+IF(AND(ISNUMBER(FIND(K$8,$H$56)),ISNUMBER(FIND($I9,$H$56))),1,0)+IF(AND(ISNUMBER(FIND(K$8,$H$57)),ISNUMBER(FIND($I9,$H$57))),1,0)+IF(AND(ISNUMBER(FIND(K$8,$H$58)),ISNUMBER(FIND($I9,$H$58))),1,0)+IF(AND(ISNUMBER(FIND(K$8,$H$59)),ISNUMBER(FIND($I9,$H$59))),1,0)+IF(AND(ISNUMBER(FIND(K$8,$H$60)),ISNUMBER(FIND($I9,$H$60))),1,0)+IF(AND(ISNUMBER(FIND(K$8,$H$61)),ISNUMBER(FIND($I9,$H$61))),1,0)+IF(AND(ISNUMBER(FIND(K$8,$H$62)),ISNUMBER(FIND($I9,$H$62))),1,0)+IF(AND(ISNUMBER(FIND(K$8,$H$63)),ISNUMBER(FIND($I9,$H$63))),1,0)+IF(AND(ISNUMBER(FIND(K$8,$H$64)),ISNUMBER(FIND($I9,$H$64))),1,0)+IF(AND(ISNUMBER(FIND(K$8,$H$65)),ISNUMBER(FIND($I9,$H$65))),1,0)+IF(AND(ISNUMBER(FIND(K$8,$H$66)),ISNUMBER(FIND($I9,$H$66))),1,0)+IF(AND(ISNUMBER(FIND(K$8,$H$67)),ISNUMBER(FIND($I9,$H$67))),1,0)+IF(AND(ISNUMBER(FIND(K$8,$H$68)),ISNUMBER(FIND($I9,$H$68))),1,0)+IF(AND(ISNUMBER(FIND(K$8,$H$69)),ISNUMBER(FIND($I9,$H$69))),1,0)+IF(AND(ISNUMBER(FIND(K$8,$H$70)),ISNUMBER(FIND($I9,$H$70))),1,0)+IF(AND(ISNUMBER(FIND(K$8,$H$71)),ISNUMBER(FIND($I9,$H$71))),1,0)+IF(AND(ISNUMBER(FIND(K$8,$H$72)),ISNUMBER(FIND($I9,$H$72))),1,0)+IF(AND(ISNUMBER(FIND(K$8,$H$73)),ISNUMBER(FIND($I9,$H$73))),1,0)+IF(AND(ISNUMBER(FIND(K$8,$H$74)),ISNUMBER(FIND($I9,$H$74))),1,0)+IF(AND(ISNUMBER(FIND(K$8,$H$75)),ISNUMBER(FIND($I9,$H$75))),1,0)+IF(AND(ISNUMBER(FIND(K$8,$H$76)),ISNUMBER(FIND($I9,$H$76))),1,0)","v":6},5,5,5,4,3,6,4,4,4,4,3,5,4,5,3,5]
["R5",{"$f":"VLOOKUP(VALUE(MID($A10,2,2)),Bron!$A$2:$G$46,B$3+1,FALSE)","v":12},{"$f":"VLOOKUP(VALUE(MID($A10,2,2)),Bron!$A$2:$G$46,C$3+1,FALSE)","v":13},{"$f":"VLOOKUP(VALUE(MID($A10,2,2)),Bron!$A$2:$G$46,D$3+1,FALSE)","v":14},{"$f":"VLOOKUP(VALUE(MID($A10,2,2)),Bron!$A$2:$G$46,E$3+1,FALSE)","v":4},{"$f":"VLOOKUP(VALUE(MID($A10,2,2)),Bron!$A$2:$G$46,F$3+1,FALSE)","v":9},{"$f":"VLOOKUP(VALUE(MID($A10,2,2)),Bron!$A$2:$G$46,G$3+1,FALSE)","v":16},"12;13;14;04;09;16","02",null,null,{"$f":"IF(AND(ISNUMBER(FIND(L$8,$H$4)),ISNUMBER(FIND($I10,$H$4))),1,0)+IF(AND(ISNUMBER(FIND(L$8,$H$5)),ISNUMBER(FIND($I10,$H$5))),1,0)+IF(AND(ISNUMBER(FIND(L$8,$H$6)),ISNUMBER(FIND($I10,$H$6))),1,0)+IF(AND(ISNUMBER(FIND(L$8,$H$7)),ISNUMBER(FIND($I10,$H$7))),1,0)+IF(AND(ISNUMBER(FIND(L$8,$H$8)),ISNUMBER(FIND($I10,$H$8))),1,0)+IF(AND(ISNUMBER(FIND(L$8,$H$9)),ISNUMBER(FIND($I10,$H$9))),1,0)+IF(AND(ISNUMBER(FIND(L$8,$H$10)),ISNUMBER(FIND($I10,$H$10))),1,0)+IF(AND(ISNUMBER(FIND(L$8,$H$11)),ISNUMBER(FIND($I10,$H$11))),1,0)+IF(AND(ISNUMBER(FIND(L$8,$H$12)),ISNUMBER(FIND($I10,$H$12))),1,0)+IF(AND(ISNUMBER(FIND(L$8,$H$13)),ISNUMBER(FIND($I10,$H$13))),1,0)+IF(AND(ISNUMBER(FIND(L$8,$H$14)),ISNUMBER(FIND($I10,$H$14))),1,0)+IF(AND(ISNUMBER(FIND(L$8,$H$15)),ISNUMBER(FIND($I10,$H$15))),1,0)+IF(AND(ISNUMBER(FIND(L$8,$H$16)),ISNUMBER(FIND($I10,$H$16))),1,0)+IF(AND(ISNUMBER(FIND(L$8,$H$17)),ISNUMBER(FIND($I10,$H$17))),1,0)+IF(AND(ISNUMBER(FIND(L$8,$H$18)),ISNUMBER(FIND($I10,$H$18))),1,0)+IF(AND(ISNUMBER(FIND(L$8,$H$19)),ISNUMBER(FIND($I10,$H$19))),1,0)+IF(AND(ISNUMBER(FIND(L$8,$H$20)),ISNUMBER(FIND($I10,$H$20))),1,0)+IF(AND(ISNUMBER(FIND(L$8,$H$21)),ISNUMBER(FIND($I10,$H$21))),1,0)+IF(AND(ISNUMBER(FIND(L$8,$H$22)),ISNUMBER(FIND($I10,$H$22))),1,0)+IF(AND(ISNUMBER(FIND(L$8,$H$23)),ISNUMBER(FIND($I10,$H$23))),1,0)+IF(AND(ISNUMBER(FIND(L$8,$H$24)),ISNUMBER(FIND($I10,$H$24))),1,0)+IF(AND(ISNUMBER(FIND(L$8,$H$25)),ISNUMBER(FIND($I10,$H$25))),1,0)+IF(AND(ISNUMBER(FIND(L$8,$H$26)),ISNUMBER(FIND($I10,$H$26))),1,0)+IF(AND(ISNUMBER(FIND(L$8,$H$27)),ISNUMBER(FIND($I10,$H$27))),1,0)+IF(AND(ISNUMBER(FIND(L$8,$H$28)),ISNUMBER(FIND($I10,$H$28))),1,0)+IF(AND(ISNUMBER(FIND(L$8,$H$29)),ISNUMBER(FIND($I10,$H$29))),1,0)+IF(AND(ISNUMBER(FIND(L$8,$H$30)),ISNUMBER(FIND($I10,$H$30))),1,0)+IF(AND(ISNUMBER(FIND(L$8,$H$31)),ISNUMBER(FIND($I10,$H$31))),1,0)+IF(AND(ISNUMBER(FIND(L$8,$H$32)),ISNUMBER(FIND($I10,$H$32))),1,0)+IF(AND(ISNUMBER(FIND(L$8,$H$33)),ISNUMBER(FIND($I10,$H$33))),1,0)+IF(AND(ISNUMBER(FIND(L$8,$H$34)),ISNUMBER(FIND($I10,$H$34))),1,0)+IF(AND(ISNUMBER(FIND(L$8,$H$35)),ISNUMBER(FIND($I10,$H$35))),1,0)+IF(AND(ISNUMBER(FIND(L$8,$H$36)),ISNUMBER(FIND($I10,$H$36))),1,0)+IF(AND(ISNUMBER(FIND(L$8,$H$37)),ISNUMBER(FIND($I10,$H$37))),1,0)+IF(AND(ISNUMBER(FIND(L$8,$H$38)),ISNUMBER(FIND($I10,$H$38))),1,0)+IF(AND(ISNUMBER(FIND(L$8,$H$39)),ISNUMBER(FIND($I10,$H$39))),1,0)+IF(AND(ISNUMBER(FIND(L$8,$H$40)),ISNUMBER(FIND($I10,$H$40))),1,0)+IF(AND(ISNUMBER(FIND(L$8,$H$41)),ISNUMBER(FIND($I10,$H$41))),1,0)+IF(AND(ISNUMBER(FIND(L$8,$H$42)),ISNUMBER(FIND($I10,$H$42))),1,0)+IF(AND(ISNUMBER(FIND(L$8,$H$43)),ISNUMBER(FIND($I10,$H$43))),1,0)+IF(AND(ISNUMBER(FIND(L$8,$H$44)),ISNUMBER(FIND($I10,$H$44))),1,0)+IF(AND(ISNUMBER(FIND(L$8,$H$45)),ISNUMBER(FIND($I10,$H$45))),1,0)+IF(AND(ISNUMBER(FIND(L$8,$H$46)),ISNUMBER(FIND($I10,$H$46))),1,0)+IF(AND(ISNUMBER(FIND(L$8,$H$47)),ISNUMBER(FIND($I10,$H$47))),1,0)+IF(AND(ISNUMBER(FIND(L$8,$H$48)),ISNUMBER(FIND($I10,$H$48))),1,0)+IF(AND(ISNUMBER(FIND(L$8,$H$49)),ISNUMBER(FIND($I10,$H$49))),1,0)+IF(AND(ISNUMBER(FIND(L$8,$H$50)),ISNUMBER(FIND($I10,$H$50))),1,0)+IF(AND(ISNUMBER(FIND(L$8,$H$51)),ISNUMBER(FIND($I10,$H$51))),1,0)+IF(AND(ISNUMBER(FIND(L$8,$H$52)),ISNUMBER(FIND($I10,$H$52))),1,0)+IF(AND(ISNUMBER(FIND(L$8,$H$53)),ISNUMBER(FIND($I10,$H$53))),1,0)+IF(AND(ISNUMBER(FIND(L$8,$H$54)),ISNUMBER(FIND($I10,$H$54))),1,0)+IF(AND(ISNUMBER(FIND(L$8,$H$55)),ISNUMBER(FIND($I10,$H$55))),1,0)+IF(AND(ISNUMBER(FIND(L$8,$H$56)),ISNUMBER(FIND($I10,$H$56))),1,0)+IF(AND(ISNUMBER(FIND(L$8,$H$57)),ISNUMBER(FIND($I10,$H$57))),1,0)+IF(AND(ISNUMBER(FIND(L$8,$H$58)),ISNUMBER(FIND($I10,$H$58))),1,0)+IF(AND(ISNUMBER(FIND(L$8,$H$59)),ISNUMBER(FIND($I10,$H$59))),1,0)+IF(AND(ISNUMBER(FIND(L$8,$H$60)),ISNUMBER(FIND($I10,$H$60))),1,0)+IF(AND(ISNUMBER(FIND(L$8,$H$61)),ISNUMBER(FIND($I10,$H$61))),1,0)+IF(AND(ISNUMBER(FIND(L$8,$H$62)),ISNUMBER(FIND($I10,$H$62))),1,0)+IF(AND(ISNUMBER(FIND(L$8,$H$63)),ISNUMBER(FIND($I10,$H$63))),1,0)+IF(AND(ISNUMBER(FIND(L$8,$H$64)),ISNUMBER(FIND($I10,$H$64))),1,0)+IF(AND(ISNUMBER(FIND(L$8,$H$65)),ISNUMBER(FIND($I10,$H$65))),1,0)+IF(AND(ISNUMBER(FIND(L$8,$H$66)),ISNUMBER(FIND($I10,$H$66))),1,0)+IF(AND(ISNUMBER(FIND(L$8,$H$67)),ISNUMBER(FIND($I10,$H$67))),1,0)+IF(AND(ISNUMBER(FIND(L$8,$H$68)),ISNUMBER(FIND($I10,$H$68))),1,0)+IF(AND(ISNUMBER(FIND(L$8,$H$69)),ISNUMBER(FIND($I10,$H$69))),1,0)+IF(AND(ISNUMBER(FIND(L$8,$H$70)),ISNUMBER(FIND($I10,$H$70))),1,0)+IF(AND(ISNUMBER(FIND(L$8,$H$71)),ISNUMBER(FIND($I10,$H$71))),1,0)+IF(AND(ISNUMBER(FIND(L$8,$H$72)),ISNUMBER(FIND($I10,$H$72))),1,0)+IF(AND(ISNUMBER(FIND(L$8,$H$73)),ISNUMBER(FIND($I10,$H$73))),1,0)+IF(AND(ISNUMBER(FIND(L$8,$H$74)),ISNUMBER(FIND($I10,$H$74))),1,0)+IF(AND(ISNUMBER(FIND(L$8,$H$75)),ISNUMBER(FIND($I10,$H$75))),1,0)+IF(AND(ISNUMBER(FIND(L$8,$H$76)),ISNUMBER(FIND($I10,$H$76))),1,0)","v":4},4,5,4,4,5,5,4,3,5,5,5,3,5,4,4]
["R6",{"$f":"VLOOKUP(VALUE(MID($A11,2,2)),Bron!$A$2:$G$46,B$3+1,FALSE)","v":10},{"$f":"VLOOKUP(VALUE(MID($A11,2,2)),Bron!$A$2:$G$46,C$3+1,FALSE)","v":5},{"$f":"VLOOKUP(VALUE(MID($A11,2,2)),Bron!$A$2:$G$46,D$3+1,FALSE)","v":6},{"$f":"VLOOKUP(VALUE(MID($A11,2,2)),Bron!$A$2:$G$46,E$3+1,FALSE)","v":17},{"$f":"VLOOKUP(VALUE(MID($A11,2,2)),Bron!$A$2:$G$46,F$3+1,FALSE)","v":8},{"$f":"VLOOKUP(VALUE(MID($A11,2,2)),Bron!$A$2:$G$46,G$3+1,FALSE)","v":15},"10;05;06;17;08;15","03",null,null,null,{"$f":"IF(AND(ISNUMBER(FIND(M$8,$H$4)),ISNUMBER(FIND($I11,$H$4))),1,0)+IF(AND(ISNUMBER(FIND(M$8,$H$5)),ISNUMBER(FIND($I11,$H$5))),1,0)+IF(AND(ISNUMBER(FIND(M$8,$H$6)),ISNUMBER(FIND($I11,$H$6))),1,0)+IF(AND(ISNUMBER(FIND(M$8,$H$7)),ISNUMBER(FIND($I11,$H$7))),1,0)+IF(AND(ISNUMBER(FIND(M$8,$H$8)),ISNUMBER(FIND($I11,$H$8))),1,0)+IF(AND(ISNUMBER(FIND(M$8,$H$9)),ISNUMBER(FIND($I11,$H$9))),1,0)+IF(AND(ISNUMBER(FIND(M$8,$H$10)),ISNUMBER(FIND($I11,$H$10))),1,0)+IF(AND(ISNUMBER(FIND(M$8,$H$11)),ISNUMBER(FIND($I11,$H$11))),1,0)+IF(AND(ISNUMBER(FIND(M$8,$H$12)),ISNUMBER(FIND($I11,$H$12))),1,0)+IF(AND(ISNUMBER(FIND(M$8,$H$13)),ISNUMBER(FIND($I11,$H$13))),1,0)+IF(AND(ISNUMBER(FIND(M$8,$H$14)),ISNUMBER(FIND($I11,$H$14))),1,0)+IF(AND(ISNUMBER(FIND(M$8,$H$15)),ISNUMBER(FIND($I11,$H$15))),1,0)+IF(AND(ISNUMBER(FIND(M$8,$H$16)),ISNUMBER(FIND($I11,$H$16))),1,0)+IF(AND(ISNUMBER(FIND(M$8,$H$17)),ISNUMBER(FIND($I11,$H$17))),1,0)+IF(AND(ISNUMBER(FIND(M$8,$H$18)),ISNUMBER(FIND($I11,$H$18))),1,0)+IF(AND(ISNUMBER(FIND(M$8,$H$19)),ISNUMBER(FIND($I11,$H$19))),1,0)+IF(AND(ISNUMBER(FIND(M$8,$H$20)),ISNUMBER(FIND($I11,$H$20))),1,0)+IF(AND(ISNUMBER(FIND(M$8,$H$21)),ISNUMBER(FIND($I11,$H$21))),1,0)+IF(AND(ISNUMBER(FIND(M$8,$H$22)),ISNUMBER(FIND($I11,$H$22))),1,0)+IF(AND(ISNUMBER(FIND(M$8,$H$23)),ISNUMBER(FIND($I11,$H$23))),1,0)+IF(AND(ISNUMBER(FIND(M$8,$H$24)),ISNUMBER(FIND($I11,$H$24))),1,0)+IF(AND(ISNUMBER(FIND(M$8,$H$25)),ISNUMBER(FIND($I11,$H$25))),1,0)+IF(AND(ISNUMBER(FIND(M$8,$H$26)),ISNUMBER(FIND($I11,$H$26))),1,0)+IF(AND(ISNUMBER(FIND(M$8,$H$27)),ISNUMBER(FIND($I11,$H$27))),1,0)+IF(AND(ISNUMBER(FIND(M$8,$H$28)),ISNUMBER(FIND($I11,$H$28))),1,0)+IF(AND(ISNUMBER(FIND(M$8,$H$29)),ISNUMBER(FIND($I11,$H$29))),1,0)+IF(AND(ISNUMBER(FIND(M$8,$H$30)),ISNUMBER(FIND($I11,$H$30))),1,0)+IF(AND(ISNUMBER(FIND(M$8,$H$31)),ISNUMBER(FIND($I11,$H$31))),1,0)+IF(AND(ISNUMBER(FIND(M$8,$H$32)),ISNUMBER(FIND($I11,$H$32))),1,0)+IF(AND(ISNUMBER(FIND(M$8,$H$33)),ISNUMBER(FIND($I11,$H$33))),1,0)+IF(AND(ISNUMBER(FIND(M$8,$H$34)),ISNUMBER(FIND($I11,$H$34))),1,0)+IF(AND(ISNUMBER(FIND(M$8,$H$35)),ISNUMBER(FIND($I11,$H$35))),1,0)+IF(AND(ISNUMBER(FIND(M$8,$H$36)),ISNUMBER(FIND($I11,$H$36))),1,0)+IF(AND(ISNUMBER(FIND(M$8,$H$37)),ISNUMBER(FIND($I11,$H$37))),1,0)+IF(AND(ISNUMBER(FIND(M$8,$H$38)),ISNUMBER(FIND($I11,$H$38))),1,0)+IF(AND(ISNUMBER(FIND(M$8,$H$39)),ISNUMBER(FIND($I11,$H$39))),1,0)+IF(AND(ISNUMBER(FIND(M$8,$H$40)),ISNUMBER(FIND($I11,$H$40))),1,0)+IF(AND(ISNUMBER(FIND(M$8,$H$41)),ISNUMBER(FIND($I11,$H$41))),1,0)+IF(AND(ISNUMBER(FIND(M$8,$H$42)),ISNUMBER(FIND($I11,$H$42))),1,0)+IF(AND(ISNUMBER(FIND(M$8,$H$43)),ISNUMBER(FIND($I11,$H$43))),1,0)+IF(AND(ISNUMBER(FIND(M$8,$H$44)),ISNUMBER(FIND($I11,$H$44))),1,0)+IF(AND(ISNUMBER(FIND(M$8,$H$45)),ISNUMBER(FIND($I11,$H$45))),1,0)+IF(AND(ISNUMBER(FIND(M$8,$H$46)),ISNUMBER(FIND($I11,$H$46))),1,0)+IF(AND(ISNUMBER(FIND(M$8,$H$47)),ISNUMBER(FIND($I11,$H$47))),1,0)+IF(AND(ISNUMBER(FIND(M$8,$H$48)),ISNUMBER(FIND($I11,$H$48))),1,0)+IF(AND(ISNUMBER(FIND(M$8,$H$49)),ISNUMBER(FIND($I11,$H$49))),1,0)+IF(AND(ISNUMBER(FIND(M$8,$H$50)),ISNUMBER(FIND($I11,$H$50))),1,0)+IF(AND(ISNUMBER(FIND(M$8,$H$51)),ISNUMBER(FIND($I11,$H$51))),1,0)+IF(AND(ISNUMBER(FIND(M$8,$H$52)),ISNUMBER(FIND($I11,$H$52))),1,0)+IF(AND(ISNUMBER(FIND(M$8,$H$53)),ISNUMBER(FIND($I11,$H$53))),1,0)+IF(AND(ISNUMBER(FIND(M$8,$H$54)),ISNUMBER(FIND($I11,$H$54))),1,0)+IF(AND(ISNUMBER(FIND(M$8,$H$55)),ISNUMBER(FIND($I11,$H$55))),1,0)+IF(AND(ISNUMBER(FIND(M$8,$H$56)),ISNUMBER(FIND($I11,$H$56))),1,0)+IF(AND(ISNUMBER(FIND(M$8,$H$57)),ISNUMBER(FIND($I11,$H$57))),1,0)+IF(AND(ISNUMBER(FIND(M$8,$H$58)),ISNUMBER(FIND($I11,$H$58))),1,0)+IF(AND(ISNUMBER(FIND(M$8,$H$59)),ISNUMBER(FIND($I11,$H$59))),1,0)+IF(AND(ISNUMBER(FIND(M$8,$H$60)),ISNUMBER(FIND($I11,$H$60))),1,0)+IF(AND(ISNUMBER(FIND(M$8,$H$61)),ISNUMBER(FIND($I11,$H$61))),1,0)+IF(AND(ISNUMBER(FIND(M$8,$H$62)),ISNUMBER(FIND($I11,$H$62))),1,0)+IF(AND(ISNUMBER(FIND(M$8,$H$63)),ISNUMBER(FIND($I11,$H$63))),1,0)+IF(AND(ISNUMBER(FIND(M$8,$H$64)),ISNUMBER(FIND($I11,$H$64))),1,0)+IF(AND(ISNUMBER(FIND(M$8,$H$65)),ISNUMBER(FIND($I11,$H$65))),1,0)+IF(AND(ISNUMBER(FIND(M$8,$H$66)),ISNUMBER(FIND($I11,$H$66))),1,0)+IF(AND(ISNUMBER(FIND(M$8,$H$67)),ISNUMBER(FIND($I11,$H$67))),1,0)+IF(AND(ISNUMBER(FIND(M$8,$H$68)),ISNUMBER(FIND($I11,$H$68))),1,0)+IF(AND(ISNUMBER(FIND(M$8,$H$69)),ISNUMBER(FIND($I11,$H$69))),1,0)+IF(AND(ISNUMBER(FIND(M$8,$H$70)),ISNUMBER(FIND($I11,$H$70))),1,0)+IF(AND(ISNUMBER(FIND(M$8,$H$71)),ISNUMBER(FIND($I11,$H$71))),1,0)+IF(AND(ISNUMBER(FIND(M$8,$H$72)),ISNUMBER(FIND($I11,$H$72))),1,0)+IF(AND(ISNUMBER(FIND(M$8,$H$73)),ISNUMBER(FIND($I11,$H$73))),1,0)+IF(AND(ISNUMBER(FIND(M$8,$H$74)),ISNUMBER(FIND($I11,$H$74))),1,0)+IF(AND(ISNUMBER(FIND(M$8,$H$75)),ISNUMBER(FIND($I11,$H$75))),1,0)+IF(AND(ISNUMBER(FIND(M$8,$H$76)),ISNUMBER(FIND($I11,$H$76))),1,0)","v":3},3,3,5,5,5,4,5,5,5,5,4,4,5,5]
["Flight 3",{"$nulls":7},"04",{"$nulls":4},{"$f":"IF(AND(ISNUMBER(FIND(N$8,$H$4)),ISNUMBER(FIND($I12,$H$4))),1,0)+IF(AND(ISNUMBER(FIND(N$8,$H$5)),ISNUMBER(FIND($I12,$H$5))),1,0)+IF(AND(ISNUMBER(FIND(N$8,$H$6)),ISNUMBER(FIND($I12,$H$6))),1,0)+IF(AND(ISNUMBER(FIND(N$8,$H$7)),ISNUMBER(FIND($I12,$H$7))),1,0)+IF(AND(ISNUMBER(FIND(N$8,$H$8)),ISNUMBER(FIND($I12,$H$8))),1,0)+IF(AND(ISNUMBER(FIND(N$8,$H$9)),ISNUMBER(FIND($I12,$H$9))),1,0)+IF(AND(ISNUMBER(FIND(N$8,$H$10)),ISNUMBER(FIND($I12,$H$10))),1,0)+IF(AND(ISNUMBER(FIND(N$8,$H$11)),ISNUMBER(FIND($I12,$H$11))),1,0)+IF(AND(ISNUMBER(FIND(N$8,$H$12)),ISNUMBER(FIND($I12,$H$12))),1,0)+IF(AND(ISNUMBER(FIND(N$8,$H$13)),ISNUMBER(FIND($I12,$H$13))),1,0)+IF(AND(ISNUMBER(FIND(N$8,$H$14)),ISNUMBER(FIND($I12,$H$14))),1,0)+IF(AND(ISNUMBER(FIND(N$8,$H$15)),ISNUMBER(FIND($I12,$H$15))),1,0)+IF(AND(ISNUMBER(FIND(N$8,$H$16)),ISNUMBER(FIND($I12,$H$16))),1,0)+IF(AND(ISNUMBER(FIND(N$8,$H$17)),ISNUMBER(FIND($I12,$H$17))),1,0)+IF(AND(ISNUMBER(FIND(N$8,$H$18)),ISNUMBER(FIND($I12,$H$18))),1,0)+IF(AND(ISNUMBER(FIND(N$8,$H$19)),ISNUMBER(FIND($I12,$H$19))),1,0)+IF(AND(ISNUMBER(FIND(N$8,$H$20)),ISNUMBER(FIND($I12,$H$20))),1,0)+IF(AND(ISNUMBER(FIND(N$8,$H$21)),ISNUMBER(FIND($I12,$H$21))),1,0)+IF(AND(ISNUMBER(FIND(N$8,$H$22)),ISNUMBER(FIND($I12,$H$22))),1,0)+IF(AND(ISNUMBER(FIND(N$8,$H$23)),ISNUMBER(FIND($I12,$H$23))),1,0)+IF(AND(ISNUMBER(FIND(N$8,$H$24)),ISNUMBER(FIND($I12,$H$24))),1,0)+IF(AND(ISNUMBER(FIND(N$8,$H$25)),ISNUMBER(FIND($I12,$H$25))),1,0)+IF(AND(ISNUMBER(FIND(N$8,$H$26)),ISNUMBER(FIND($I12,$H$26))),1,0)+IF(AND(ISNUMBER(FIND(N$8,$H$27)),ISNUMBER(FIND($I12,$H$27))),1,0)+IF(AND(ISNUMBER(FIND(N$8,$H$28)),ISNUMBER(FIND($I12,$H$28))),1,0)+IF(AND(ISNUMBER(FIND(N$8,$H$29)),ISNUMBER(FIND($I12,$H$29))),1,0)+IF(AND(ISNUMBER(FIND(N$8,$H$30)),ISNUMBER(FIND($I12,$H$30))),1,0)+IF(AND(ISNUMBER(FIND(N$8,$H$31)),ISNUMBER(FIND($I12,$H$31))),1,0)+IF(AND(ISNUMBER(FIND(N$8,$H$32)),ISNUMBER(FIND($I12,$H$32))),1,0)+IF(AND(ISNUMBER(FIND(N$8,$H$33)),ISNUMBER(FIND($I12,$H$33))),1,0)+IF(AND(ISNUMBER(FIND(N$8,$H$34)),ISNUMBER(FIND($I12,$H$34))),1,0)+IF(AND(ISNUMBER(FIND(N$8,$H$35)),ISNUMBER(FIND($I12,$H$35))),1,0)+IF(AND(ISNUMBER(FIND(N$8,$H$36)),ISNUMBER(FIND($I12,$H$36))),1,0)+IF(AND(ISNUMBER(FIND(N$8,$H$37)),ISNUMBER(FIND($I12,$H$37))),1,0)+IF(AND(ISNUMBER(FIND(N$8,$H$38)),ISNUMBER(FIND($I12,$H$38))),1,0)+IF(AND(ISNUMBER(FIND(N$8,$H$39)),ISNUMBER(FIND($I12,$H$39))),1,0)+IF(AND(ISNUMBER(FIND(N$8,$H$40)),ISNUMBER(FIND($I12,$H$40))),1,0)+IF(AND(ISNUMBER(FIND(N$8,$H$41)),ISNUMBER(FIND($I12,$H$41))),1,0)+IF(AND(ISNUMBER(FIND(N$8,$H$42)),ISNUMBER(FIND($I12,$H$42))),1,0)+IF(AND(ISNUMBER(FIND(N$8,$H$43)),ISNUMBER(FIND($I12,$H$43))),1,0)+IF(AND(ISNUMBER(FIND(N$8,$H$44)),ISNUMBER(FIND($I12,$H$44))),1,0)+IF(AND(ISNUMBER(FIND(N$8,$H$45)),ISNUMBER(FIND($I12,$H$45))),1,0)+IF(AND(ISNUMBER(FIND(N$8,$H$46)),ISNUMBER(FIND($I12,$H$46))),1,0)+IF(AND(ISNUMBER(FIND(N$8,$H$47)),ISNUMBER(FIND($I12,$H$47))),1,0)+IF(AND(ISNUMBER(FIND(N$8,$H$48)),ISNUMBER(FIND($I12,$H$48))),1,0)+IF(AND(ISNUMBER(FIND(N$8,$H$49)),ISNUMBER(FIND($I12,$H$49))),1,0)+IF(AND(ISNUMBER(FIND(N$8,$H$50)),ISNUMBER(FIND($I12,$H$50))),1,0)+IF(AND(ISNUMBER(FIND(N$8,$H$51)),ISNUMBER(FIND($I12,$H$51))),1,0)+IF(AND(ISNUMBER(FIND(N$8,$H$52)),ISNUMBER(FIND($I12,$H$52))),1,0)+IF(AND(ISNUMBER(FIND(N$8,$H$53)),ISNUMBER(FIND($I12,$H$53))),1,0)+IF(AND(ISNUMBER(FIND(N$8,$H$54)),ISNUMBER(FIND($I12,$H$54))),1,0)+IF(AND(ISNUMBER(FIND(N$8,$H$55)),ISNUMBER(FIND($I12,$H$55))),1,0)+IF(AND(ISNUMBER(FIND(N$8,$H$56)),ISNUMBER(FIND($I12,$H$56))),1,0)+IF(AND(ISNUMBER(FIND(N$8,$H$57)),ISNUMBER(FIND($I12,$H$57))),1,0)+IF(AND(ISNUMBER(FIND(N$8,$H$58)),ISNUMBER(FIND($I12,$H$58))),1,0)+IF(AND(ISNUMBER(FIND(N$8,$H$59)),ISNUMBER(FIND($I12,$H$59))),1,0)+IF(AND(ISNUMBER(FIND(N$8,$H$60)),ISNUMBER(FIND($I12,$H$60))),1,0)+IF(AND(ISNUMBER(FIND(N$8,$H$61)),ISNUMBER(FIND($I12,$H$61))),1,0)+IF(AND(ISNUMBER(FIND(N$8,$H$62)),ISNUMBER(FIND($I12,$H$62))),1,0)+IF(AND(ISNUMBER(FIND(N$8,$H$63)),ISNUMBER(FIND($I12,$H$63))),1,0)+IF(AND(ISNUMBER(FIND(N$8,$H$64)),ISNUMBER(FIND($I12,$H$64))),1,0)+IF(AND(ISNUMBER(FIND(N$8,$H$65)),ISNUMBER(FIND($I12,$H$65))),1,0)+IF(AND(ISNUMBER(FIND(N$8,$H$66)),ISNUMBER(FIND($I12,$H$66))),1,0)+IF(AND(ISNUMBER(FIND(N$8,$H$67)),ISNUMBER(FIND($I12,$H$67))),1,0)+IF(AND(ISNUMBER(FIND(N$8,$H$68)),ISNUMBER(FIND($I12,$H$68))),1,0)+IF(AND(ISNUMBER(FIND(N$8,$H$69)),ISNUMBER(FIND($I12,$H$69))),1,0)+IF(AND(ISNUMBER(FIND(N$8,$H$70)),ISNUMBER(FIND($I12,$H$70))),1,0)+IF(AND(ISNUMBER(FIND(N$8,$H$71)),ISNUMBER(FIND($I12,$H$71))),1,0)+IF(AND(ISNUMBER(FIND(N$8,$H$72)),ISNUMBER(FIND($I12,$H$72))),1,0)+IF(AND(ISNUMBER(FIND(N$8,$H$73)),ISNUMBER(FIND($I12,$H$73))),1,0)+IF(AND(ISNUMBER(FIND(N$8,$H$74)),ISNUMBER(FIND($I12,$H$74))),1,0)+IF(AND(ISNUMBER(FIND(N$8,$H$75)),ISNUMBER(FIND($I12,$H$75))),1,0)+IF(AND(ISNUMBER(FIND(N$8,$H$76)),ISNUMBER(FIND($I12,$H$76))),1,0)","v":4},5,5,5,6,5,5,4,4,4,5,4,3,4]
[null,1.0,2.0,3.0,4.0,5.0,6.0,null,"05",{"$nulls":5},{"$f":"IF(AND(ISNUMBER(FIND(O$8,$H$4)),ISNUMBER(FIND($I13,$H$4))),1,0)+IF(AND(ISNUMBER(FIND(O$8,$H$5)),ISNUMBER(FIND($I13,$H$5))),1,0)+IF(AND(ISNUMBER(FIND(O$8,$H$6)),ISNUMBER(FIND($I13,$H$6))),1,0)+IF(AND(ISNUMBER(FIND(O$8,$H$7)),ISNUMBER(FIND($I13,$H$7))),1,0)+IF(AND(ISNUMBER(FIND(O$8,$H$8)),ISNUMBER(FIND($I13,$H$8))),1,0)+IF(AND(ISNUMBER(FIND(O$8,$H$9)),ISNUMBER(FIND($I13,$H$9))),1,0)+IF(AND(ISNUMBER(FIND(O$8,$H$10)),ISNUMBER(FIND($I13,$H$10))),1,0)+IF(AND(ISNUMBER(FIND(O$8,$H$11)),ISNUMBER(FIND($I13,$H$11))),1,0)+IF(AND(ISNUMBER(FIND(O$8,$H$12)),ISNUMBER(FIND($I13,$H$12))),1,0)+IF(AND(ISNUMBER(FIND(O$8,$H$13)),ISNUMBER(FIND($I13,$H$13))),1,0)+IF(AND(ISNUMBER(FIND(O$8,$H$14)),ISNUMBER(FIND($I13,$H$14))),1,0)+IF(AND(ISNUMBER(FIND(O$8,$H$15)),ISNUMBER(FIND($I13,$H$15))),1,0)+IF(AND(ISNUMBER(FIND(O$8,$H$16)),ISNUMBER(FIND($I13,$H$16))),1,0)+IF(AND(ISNUMBER(FIND(O$8,$H$17)),ISNUMBER(FIND($I13,$H$17))),1,0)+IF(AND(ISNUMBER(FIND(O$8,$H$18)),ISNUMBER(FIND($I13,$H$18))),1,0)+IF(AND(ISNUMBER(FIND(O$8,$H$19)),ISNUMBER(FIND($I13,$H$19))),1,0)+IF(AND(ISNUMBER(FIND(O$8,$H$20)),ISNUMBER(FIND($I13,$H$20))),1,0)+IF(AND(ISNUMBER(FIND(O$8,$H$21)),ISNUMBER(FIND($I13,$H$21))),1,0)+IF(AND(ISNUMBER(FIND(O$8,$H$22)),ISNUMBER(FIND($I13,$H$22))),1,0)+IF(AND(ISNUMBER(FIND(O$8,$H$23)),ISNUMBER(FIND($I13,$H$23))),1,0)+IF(AND(ISNUMBER(FIND(O$8,$H$24)),ISNUMBER(FIND($I13,$H$24))),1,0)+IF(AND(ISNUMBER(FIND(O$8,$H$25)),ISNUMBER(FIND($I13,$H$25))),1,0)+IF(AND(ISNUMBER(FIND(O$8,$H$26)),ISNUMBER(FIND($I13,$H$26))),1,0)+IF(AND(ISNUMBER(FIND(O$8,$H$27)),ISNUMBER(FIND($I13,$H$27))),1,0)+IF(AND(ISNUMBER(FIND(O$8,$H$28)),ISNUMBER(FIND($I13,$H$28))),1,0)+IF(AND(ISNUMBER(FIND(O$8,$H$29)),ISNUMBER(FIND($I13,$H$29))),1,0)+IF(AND(ISNUMBER(FIND(O$8,$H$30)),ISNUMBER(FIND($I13,$H$30))),1,0)+IF(AND(ISNUMBER(FIND(O$8,$H$31)),ISNUMBER(FIND($I13,$H$31))),1,0)+IF(AND(ISNUMBER(FIND(O$8,$H$32)),ISNUMBER(FIND($I13,$H$32))),1,0)+IF(AND(ISNUMBER(FIND(O$8,$H$33)),ISNUMBER(FIND($I13,$H$33))),1,0)+IF(AND(ISNUMBER(FIND(O$8,$H$34)),ISNUMBER(FIND($I13,$H$34))),1,0)+IF(AND(ISNUMBER(FIND(O$8,$H$35)),ISNUMBER(FIND($I13,$H$35))),1,0)+IF(AND(ISNUMBER(FIND(O$8,$H$36)),ISNUMBER(FIND($I13,$H$36))),1,0)+IF(AND(ISNUMBER(FIND(O$8,$H$37)),ISNUMBER(FIND($I13,$H$37))),1,0)+IF(AND(ISNUMBER(FIND(O$8,$H$38)),ISNUMBER(FIND($I13,$H$38))),1,0)+IF(AND(ISNUMBER(FIND(O$8,$H$39)),ISNUMBER(FIND($I13,$H$39))),1,0)+IF(AND(ISNUMBER(FIND(O$8,$H$40)),ISNUMBER(FIND($I13,$H$40))),1,0)+IF(AND(ISNUMBER(FIND(O$8,$H$41)),ISNUMBER(FIND($I13,$H$41))),1,0)+IF(AND(ISNUMBER(FIND(O$8,$H$42)),ISNUMBER(FIND($I13,$H$42))),1,0)+IF(AND(ISNUMBER(FIND(O$8,$H$43)),ISNUMBER(FIND($I13,$H$43))),1,0)+IF(AND(ISNUMBER(FIND(O$8,$H$44)),ISNUMBER(FIND($I13,$H$44))),1,0)+IF(AND(ISNUMBER(FIND(O$8,$H$45)),ISNUMBER(FIND($I13,$H$45))),1,0)+IF(AND(ISNUMBER(FIND(O$8,$H$46)),ISNUMBER(FIND($I13,$H$46))),1,0)+IF(AND(ISNUMBER(FIND(O$8,$H$47)),ISNUMBER(FIND($I13,$H$47))),1,0)+IF(AND(ISNUMBER(FIND(O$8,$H$48)),ISNUMBER(FIND($I13,$H$48))),1,0)+IF(AND(ISNUMBER(FIND(O$8,$H$49)),ISNUMBER(FIND($I13,$H$49))),1,0)+IF(AND(ISNUMBER(FIND(O$8,$H$50)),ISNUMBER(FIND($I13,$H$50))),1,0)+IF(AND(ISNUMBER(FIND(O$8,$H$51)),ISNUMBER(FIND($I13,$H$51))),1,0)+IF(AND(ISNUMBER(FIND(O$8,$H$52)),ISNUMBER(FIND($I13,$H$52))),1,0)+IF(AND(ISNUMBER(FIND(O$8,$H$53)),ISNUMBER(FIND($I13,$H$53))),1,0)+IF(AND(ISNUMBER(FIND(O$8,$H$54)),ISNUMBER(FIND($I13,$H$54))),1,0)+IF(AND(ISNUMBER(FIND(O$8,$H$55)),ISNUMBER(FIND($I13,$H$55))),1,0)+IF(AND(ISNUMBER(FIND(O$8,$H$56)),ISNUMBER(FIND($I13,$H$56))),1,0)+IF(AND(ISNUMBER(FIND(O$8,$H$57)),ISNUMBER(FIND($I13,$H$57))),1,0)+IF(AND(ISNUMBER(FIND(O$8,$H$58)),ISNUMBER(FIND($I13,$H$58))),1,0)+IF(AND(ISNUMBER(FIND(O$8,$H$59)),ISNUMBER(FIND($I13,$H$59))),1,0)+IF(AND(ISNUMBER(FIND(O$8,$H$60)),ISNUMBER(FIND($I13,$H$60))),1,0)+IF(AND(ISNUMBER(FIND(O$8,$H$61)),ISNUMBER(FIND($I13,$H$61))),1,0)+IF(AND(ISNUMBER(FIND(O$8,$H$62)),ISNUMBER(FIND($I13,$H$62))),1,0)+IF(AND(ISNUMBER(FIND(O$8,$H$63)),ISNUMBER(FIND($I13,$H$63))),1,0)+IF(AND(ISNUMBER(FIND(O$8,$H$64)),ISNUMBER(FIND($I13,$H$64))),1,0)+IF(AND(ISNUMBER(FIND(O$8,$H$65)),ISNUMBER(FIND($I13,$H$65))),1,0)+IF(AND(ISNUMBER(FIND(O$8,$H$66)),ISNUMBER(FIND($I13,$H$66))),1,0)+IF(AND(ISNUMBER(FIND(O$8,$H$67)),ISNUMBER(FIND($I13,$H$67))),1,0)+IF(AND(ISNUMBER(FIND(O$8,$H$68)),ISNUMBER(FIND($I13,$H$68))),1,0)+IF(AND(ISNUMBER(FIND(O$8,$H$69)),ISNUMBER(FIND($I13,$H$69))),1,0)+IF(AND(ISNUMBER(FIND(O$8,$H$70)),ISNUMBER(FIND($I13,$H$70))),1,0)+IF(AND(ISNUMBER(FIND(O$8,$H$71)),ISNUMBER(FIND($I13,$H$71))),1,0)+IF(AND(ISNUMBER(FIND(O$8,$H$72)),ISNUMBER(FIND($I13,$H$72))),1,0)+IF(AND(ISNUMBER(FIND(O$8,$H$73)),ISNUMBER(FIND($I13,$H$73))),1,0)+IF(AND(ISNUMBER(FIND(O$8,$H$74)),ISNUMBER(FIND($I13,$H$74))),1,0)+IF(AND(ISNUMBER(FIND(O$8,$H$75)),ISNUMBER(FIND($I13,$H$75))),1,0)+IF(AND(ISNUMBER(FIND(O$8,$H$76)),ISNUMBER(FIND($I13,$H$76))),1,0)","v":6},3,4,4,4,4,4,5,5,5,6,4,4]
["R7",{"$f":"VLOOKUP(VALUE(MID($A14,2,2)),Bron!$A$2:$G$46,B$3+1,FALSE)","v":13},{"$f":"VLOOKUP(VALUE(MID($A14,2,2)),Bron!$A$2:$G$46,C$3+1,FALSE)","v":5},{"$f":"VLOOKUP(VALUE(MID($A14,2,2)),Bron!$A$2:$G$46,D$3+1,FALSE)","v":6},{"$f":"VLOOKUP(VALUE(MID($A14,2,2)),Bron!$A$2:$G$46,E$3+1,FALSE)","v":3},{"$f":"VLOOKUP(VALUE(MID($A14,2,2)),Bron!$A$2:$G$46,F$3+1,FALSE)","v":2},{"$f":"VLOOKUP(VALUE(MID($A14,2,2)),Bron!$A$2:$G$46,G$3+1,FALSE)","v":9},{"$f":"TEXT(B14,\"00\")&\";\"&TEXT(C14,\"00\")&\";\"&TEXT(D14,\"00\")&\";\"&TEXT(E14,\"00\")&\";\"&TEXT(F14,\"00\")&\";\"&TEXT(G14,\"00\")","v":"13;05;06;03;02;09"},"06",{"$nulls":6},{"$f":"IF(AND(ISNUMBER(FIND(P$8,$H$4)),ISNUMBER(FIND($I14,$H$4))),1,0)+IF(AND(ISNUMBER(FIND(P$8,$H$5)),ISNUMBER(FIND($I14,$H$5))),1,0)+IF(AND(ISNUMBER(FIND(P$8,$H$6)),ISNUMBER(FIND($I14,$H$6))),1,0)+IF(AND(ISNUMBER(FIND(P$8,$H$7)),ISNUMBER(FIND($I14,$H$7))),1,0)+IF(AND(ISNUMBER(FIND(P$8,$H$8)),ISNUMBER(FIND($I14,$H$8))),1,0)+IF(AND(ISNUMBER(FIND(P$8,$H$9)),ISNUMBER(FIND($I14,$H$9))),1,0)+IF(AND(ISNUMBER(FIND(P$8,$H$10)),ISNUMBER(FIND($I14,$H$10))),1,0)+IF(AND(ISNUMBER(FIND(P$8,$H$11)),ISNUMBER(FIND($I14,$H$11))),1,0)+IF(AND(ISNUMBER(FIND(P$8,$H$12)),ISNUMBER(FIND($I14,$H$12))),1,0)+IF(AND(ISNUMBER(FIND(P$8,$H$13)),ISNUMBER(FIND($I14,$H$13))),1,0)+IF(AND(ISNUMBER(FIND(P$8,$H$14)),ISNUMBER(FIND($I14,$H$14))),1,0)+IF(AND(ISNUMBER(FIND(P$8,$H$15)),ISNUMBER(FIND($I14,$H$15))),1,0)+IF(AND(ISNUMBER(FIND(P$8,$H$16)),ISNUMBER(FIND($I14,$H$16))),1,0)+IF(AND(ISNUMBER(FIND(P$8,$H$17)),ISNUMBER(FIND($I14,$H$17))),1,0)+IF(AND(ISNUMBER(FIND(P$8,$H$18)),ISNUMBER(FIND($I14,$H$18))),1,0)+IF(AND(ISNUMBER(FIND(P$8,$H$19)),ISNUMBER(FIND($I14,$H$19))),1,0)+IF(AND(ISNUMBER(FIND(P$8,$H$20)),ISNUMBER(FIND($I14,$H$20))),1,0)+IF(AND(ISNUMBER(FIND(P$8,$H$21)),ISNUMBER(FIND($I14,$H$21))),1,0)+IF(AND(ISNUMBER(FIND(P$8,$H$22)),ISNUMBER(FIND($I14,$H$22))),1,0)+IF(AND(ISNUMBER(FIND(P$8,$H$23)),ISNUMBER(FIND($I14,$H$23))),1,0)+IF(AND(ISNUMBER(FIND(P$8,$H$24)),ISNUMBER(FIND($I14,$H$24))),1,0)+IF(AND(ISNUMBER(FIND(P$8,$H$25)),ISNUMBER(FIND($I14,$H$25))),1,0)+IF(AND(ISNUMBER(FIND(P$8,$H$26)),ISNUMBER(FIND($I14,$H$26))),1,0)+IF(AND(ISNUMBER(FIND(P$8,$H$27)),ISNUMBER(FIND($I14,$H$27))),1,0)+IF(AND(ISNUMBER(FIND(P$8,$H$28)),ISNUMBER(FIND($I14,$H$28))),1,0)+IF(AND(ISNUMBER(FIND(P$8,$H$29)),ISNUMBER(FIND($I14,$H$29))),1,0)+IF(AND(ISNUMBER(FIND(P$8,$H$30)),ISNUMBER(FIND($I14,$H$30))),1,0)+IF(AND(ISNUMBER(FIND(P$8,$H$31)),ISNUMBER(FIND($I14,$H$31))),1,0)+IF(AND(ISNUMBER(FIND(P$8,$H$32)),ISNUMBER(FIND($I14,$H$32))),1,0)+IF(AND(ISNUMBER(FIND(P$8,$H$33)),ISNUMBER(FIND($I14,$H$33))),1,0)+IF(AND(ISNUMBER(FIND(P$8,$H$34)),ISNUMBER(FIND($I14,$H$34))),1,0)+IF(AND(ISNUMBER(FIND(P$8,$H$35)),ISNUMBER(FIND($I14,$H$35))),1,0)+IF(AND(ISNUMBER(FIND(P$8,$H$36)),ISNUMBER(FIND($I14,$H$36))),1,0)+IF(AND(ISNUMBER(FIND(P$8,$H$37)),ISNUMBER(FIND($I14,$H$37))),1,0)+IF(AND(ISNUMBER(FIND(P$8,$H$38)),ISNUMBER(FIND($I14,$H$38))),1,0)+IF(AND(ISNUMBER(FIND(P$8,$H$39)),ISNUMBER(FIND($I14,$H$39))),1,0)+IF(AND(ISNUMBER(FIND(P$8,$H$40)),ISNUMBER(FIND($I14,$H$40))),1,0)+IF(AND(ISNUMBER(FIND(P$8,$H$41)),ISNUMBER(FIND($I14,$H$41))),1,0)+IF(AND(ISNUMBER(FIND(P$8,$H$42)),ISNUMBER(FIND($I14,$H$42))),1,0)+IF(AND(ISNUMBER(FIND(P$8,$H$43)),ISNUMBER(FIND($I14,$H$43))),1,0)+IF(AND(ISNUMBER(FIND(P$8,$H$44)),ISNUMBER(FIND($I14,$H$44))),1,0)+IF(AND(ISNUMBER(FIND(P$8,$H$45)),ISNUMBER(FIND($I14,$H$45))),1,0)+IF(AND(ISNUMBER(FIND(P$8,$H$46)),ISNUMBER(FIND($I14,$H$46))),1,0)+IF(AND(ISNUMBER(FIND(P$8,$H$47)),ISNUMBER(FIND($I14,$H$47))),1,0)+IF(AND(ISNUMBER(FIND(P$8,$H$48)),ISNUMBER(FIND($I14,$H$48))),1,0)+IF(AND(ISNUMBER(FIND(P$8,$H$49)),ISNUMBER(FIND($I14,$H$49))),1,0)+IF(AND(ISNUMBER(FIND(P$8,$H$50)),ISNUMBER(FIND($I14,$H$50))),1,0)+IF(AND(ISNUMBER(FIND(P$8,$H$51)),ISNUMBER(FIND($I14,$H$51))),1,0)+IF(AND(ISNUMBER(FIND(P$8,$H$52)),ISNUMBER(FIND($I14,$H$52))),1,0)+IF(AND(ISNUMBER(FIND(P$8,$H$53)),ISNUMBER(FIND($I14,$H$53))),1,0)+IF(AND(ISNUMBER(FIND(P$8,$H$54)),ISNUMBER(FIND($I14,$H$54))),1,0)+IF(AND(ISNUMBER(FIND(P$8,$H$55)),ISNUMBER(FIND($I14,$H$55))),1,0)+IF(AND(ISNUMBER(FIND(P$8,$H$56)),ISNUMBER(FIND($I14,$H$56))),1,0)+IF(AND(ISNUMBER(FIND(P$8,$H$57)),ISNUMBER(FIND($I14,$H$57))),1,0)+IF(AND(ISNUMBER(FIND(P$8,$H$58)),ISNUMBER(FIND($I14,$H$58))),1,0)+IF(AND(ISNUMBER(FIND(P$8,$H$59)),ISNUMBER(FIND($I14,$H$59))),1,0)+IF(AND(ISNUMBER(FIND(P$8,$H$60)),ISNUMBER(FIND($I14,$H$60))),1,0)+IF(AND(ISNUMBER(FIND(P$8,$H$61)),ISNUMBER(FIND($I14,$H$61))),1,0)+IF(AND(ISNUMBER(FIND(P$8,$H$62)),ISNUMBER(FIND($I14,$H$62))),1,0)+IF(AND(ISNUMBER(FIND(P$8,$H$63)),ISNUMBER(FIND($I14,$H$63))),1,0)+IF(AND(ISNUMBER(FIND(P$8,$H$64)),ISNUMBER(FIND($I14,$H$64))),1,0)+IF(AND(ISNUMBER(FIND(P$8,$H$65)),ISNUMBER(FIND($I14,$H$65))),1,0)+IF(AND(ISNUMBER(FIND(P$8,$H$66)),ISNUMBER(FIND($I14,$H$66))),1,0)+IF(AND(ISNUMBER(FIND(P$8,$H$67)),ISNUMBER(FIND($I14,$H$67))),1,0)+IF(AND(ISNUMBER(FIND(P$8,$H$68)),ISNUMBER(FIND($I14,$H$68))),1,0)+IF(AND(ISNUMBER(FIND(P$8,$H$69)),ISNUMBER(FIND($I14,$H$69))),1,0)+IF(AND(ISNUMBER(FIND(P$8,$H$70)),ISNUMBER(FIND($I14,$H$70))),1,0)+IF(AND(ISNUMBER(FIND(P$8,$H$71)),ISNUMBER(FIND($I14,$H$71))),1,0)+IF(AND(ISNUMBER(FIND(P$8,$H$72)),ISNUMBER(FIND($I14,$H$72))),1,0)+IF(AND(ISNUMBER(FIND(P$8,$H$73)),ISNUMBER(FIND($I14,$H$73))),1,0)+IF(AND(ISNUMBER(FIND(P$8,$H$74)),ISNUMBER(FIND($I14,$H$74))),1,0)+IF(AND(ISNUMBER(FIND(P$8,$H$75)),ISNUMBER(FIND($I14,$H$75))),1,0)+IF(AND(ISNUMBER(FIND(P$8,$H$76)),ISNUMBER(FIND($I14,$H$76))),1,0)","v":5},5,5,4,4,5,4,4,4,4,4,5]
["R8",{"$f":"VLOOKUP(VALUE(MID($A15,2,2)),Bron!$A$2:$G$46,B$3+1,FALSE)","v":11},{"$f":"VLOOKUP(VALUE(MID($A15,2,2)),Bron!$A$2:$G$46,C$3+1,FALSE)","v":4},{"$f":"VLOOKUP(VALUE(MID($A15,2,2)),Bron!$A$2:$G$46,D$3+1,FALSE)","v":15},{"$f":"VLOOKUP(VALUE(MID($A15,2,2)),Bron!$A$2:$G$46,E$3+1,FALSE)","v":7},{"$f":"VLOOKUP(VALUE(MID($A15,2,2)),Bron!$A$2:$G$46,F$3+1,FALSE)","v":14},{"$f":"VLOOKUP(VALUE(MID($A15,2,2)),Bron!$A$2:$G$46,G$3+1,FALSE)","v":17},"11;04;15;07;14;17","07",{"$nulls":7},{"$f":"IF(AND(ISNUMBER(FIND(Q$8,$H$4)),ISNUMBER(FIND($I15,$H$4))),1,0)+IF(AND(ISNUMBER(FIND(Q$8,$H$5)),ISNUMBER(FIND($I15,$H$5))),1,0)+IF(AND(ISNUMBER(FIND(Q$8,$H$6)),ISNUMBER(FIND($I15,$H$6))),1,0)+IF(AND(ISNUMBER(FIND(Q$8,$H$7)),ISNUMBER(FIND($I15,$H$7))),1,0)+IF(AND(ISNUMBER(FIND(Q$8,$H$8)),ISNUMBER(FIND($I15,$H$8))),1,0)+IF(AND(ISNUMBER(FIND(Q$8,$H$9)),ISNUMBER(FIND($I15,$H$9))),1,0)+IF(AND(ISNUMBER(FIND(Q$8,$H$10)),ISNUMBER(FIND($I15,$H$10))),1,0)+IF(AND(ISNUMBER(FIND(Q$8,$H$11)),ISNUMBER(FIND($I15,$H$11))),1,0)+IF(AND(ISNUMBER(FIND(Q$8,$H$12)),ISNUMBER(FIND($I15,$H$12))),1,0)+IF(AND(ISNUMBER(FIND(Q$8,$H$13)),ISNUMBER(FIND($I15,$H$13))),1,0)+IF(AND(ISNUMBER(FIND(Q$8,$H$14)),ISNUMBER(FIND($I15,$H$14))),1,0)+IF(AND(ISNUMBER(FIND(Q$8,$H$15)),ISNUMBER(FIND($I15,$H$15))),1,0)+IF(AND(ISNUMBER(FIND(Q$8,$H$16)),ISNUMBER(FIND($I15,$H$16))),1,0)+IF(AND(ISNUMBER(FIND(Q$8,$H$17)),ISNUMBER(FIND($I15,$H$17))),1,0)+IF(AND(ISNUMBER(FIND(Q$8,$H$18)),ISNUMBER(FIND($I15,$H$18))),1,0)+IF(AND(ISNUMBER(FIND(Q$8,$H$19)),ISNUMBER(FIND($I15,$H$19))),1,0)+IF(AND(ISNUMBER(FIND(Q$8,$H$20)),ISNUMBER(FIND($I15,$H$20))),1,0)+IF(AND(ISNUMBER(FIND(Q$8,$H$21)),ISNUMBER(FIND($I15,$H$21))),1,0)+IF(AND(ISNUMBER(FIND(Q$8,$H$22)),ISNUMBER(FIND($I15,$H$22))),1,0)+IF(AND(ISNUMBER(FIND(Q$8,$H$23)),ISNUMBER(FIND($I15,$H$23))),1,0)+IF(AND(ISNUMBER(FIND(Q$8,$H$24)),ISNUMBER(FIND($I15,$H$24))),1,0)+IF(AND(ISNUMBER(FIND(Q$8,$H$25)),ISNUMBER(FIND($I15,$H$25))),1,0)+IF(AND(ISNUMBER(FIND(Q$8,$H$26)),ISNUMBER(FIND($I15,$H$26))),1,0)+IF(AND(ISNUMBER(FIND(Q$8,$H$27)),ISNUMBER(FIND($I15,$H$27))),1,0)+IF(AND(ISNUMBER(FIND(Q$8,$H$28)),ISNUMBER(FIND($I15,$H$28))),1,0)+IF(AND(ISNUMBER(FIND(Q$8,$H$29)),ISNUMBER(FIND($I15,$H$29))),1,0)+IF(AND(ISNUMBER(FIND(Q$8,$H$30)),ISNUMBER(FIND($I15,$H$30))),1,0)+IF(AND(ISNUMBER(FIND(Q$8,$H$31)),ISNUMBER(FIND($I15,$H$31))),1,0)+IF(AND(ISNUMBER(FIND(Q$8,$H$32)),ISNUMBER(FIND($I15,$H$32))),1,0)+IF(AND(ISNUMBER(FIND(Q$8,$H$33)),ISNUMBER(FIND($I15,$H$33))),1,0)+IF(AND(ISNUMBER(FIND(Q$8,$H$34)),ISNUMBER(FIND($I15,$H$34))),1,0)+IF(AND(ISNUMBER(FIND(Q$8,$H$35)),ISNUMBER(FIND($I15,$H$35))),1,0)+IF(AND(ISNUMBER(FIND(Q$8,$H$36)),ISNUMBER(FIND($I15,$H$36))),1,0)+IF(AND(ISNUMBER(FIND(Q$8,$H$37)),ISNUMBER(FIND($I15,$H$37))),1,0)+IF(AND(ISNUMBER(FIND(Q$8,$H$38)),ISNUMBER(FIND($I15,$H$38))),1,0)+IF(AND(ISNUMBER(FIND(Q$8,$H$39)),ISNUMBER(FIND($I15,$H$39))),1,0)+IF(AND(ISNUMBER(FIND(Q$8,$H$40)),ISNUMBER(FIND($I15,$H$40))),1,0)+IF(AND(ISNUMBER(FIND(Q$8,$H$41)),ISNUMBER(FIND($I15,$H$41))),1,0)+IF(AND(ISNUMBER(FIND(Q$8,$H$42)),ISNUMBER(FIND($I15,$H$42))),1,0)+IF(AND(ISNUMBER(FIND(Q$8,$H$43)),ISNUMBER(FIND($I15,$H$43))),1,0)+IF(AND(ISNUMBER(FIND(Q$8,$H$44)),ISNUMBER(FIND($I15,$H$44))),1,0)+IF(AND(ISNUMBER(FIND(Q$8,$H$45)),ISNUMBER(FIND($I15,$H$45))),1,0)+IF(AND(ISNUMBER(FIND(Q$8,$H$46)),ISNUMBER(FIND($I15,$H$46))),1,0)+IF(AND(ISNUMBER(FIND(Q$8,$H$47)),ISNUMBER(FIND($I15,$H$47))),1,0)+IF(AND(ISNUMBER(FIND(Q$8,$H$48)),ISNUMBER(FIND($I15,$H$48))),1,0)+IF(AND(ISNUMBER(FIND(Q$8,$H$49)),ISNUMBER(FIND($I15,$H$49))),1,0)+IF(AND(ISNUMBER(FIND(Q$8,$H$50)),ISNUMBER(FIND($I15,$H$50))),1,0)+IF(AND(ISNUMBER(FIND(Q$8,$H$51)),ISNUMBER(FIND($I15,$H$51))),1,0)+IF(AND(ISNUMBER(FIND(Q$8,$H$52)),ISNUMBER(FIND($I15,$H$52))),1,0)+IF(AND(ISNUMBER(FIND(Q$8,$H$53)),ISNUMBER(FIND($I15,$H$53))),1,0)+IF(AND(ISNUMBER(FIND(Q$8,$H$54)),ISNUMBER(FIND($I15,$H$54))),1,0)+IF(AND(ISNUMBER(FIND(Q$8,$H$55)),ISNUMBER(FIND($I15,$H$55))),1,0)+IF(AND(ISNUMBER(FIND(Q$8,$H$56)),ISNUMBER(FIND($I15,$H$56))),1,0)+IF(AND(ISNUMBER(FIND(Q$8,$H$57)),ISNUMBER(FIND($I15,$H$57))),1,0)+IF(AND(ISNUMBER(FIND(Q$8,$H$58)),ISNUMBER(FIND($I15,$H$58))),1,0)+IF(AND(ISNUMBER(FIND(Q$8,$H$59)),ISNUMBER(FIND($I15,$H$59))),1,0)+IF(AND(ISNUMBER(FIND(Q$8,$H$60)),ISNUMBER(FIND($I15,$H$60))),1,0)+IF(AND(ISNUMBER(FIND(Q$8,$H$61)),ISNUMBER(FIND($I15,$H$61))),1,0)+IF(AND(ISNUMBER(FIND(Q$8,$H$62)),ISNUMBER(FIND($I15,$H$62))),1,0)+IF(AND(ISNUMBER(FIND(Q$8,$H$63)),ISNUMBER(FIND($I15,$H$63))),1,0)+IF(AND(ISNUMBER(FIND(Q$8,$H$64)),ISNUMBER(FIND($I15,$H$64))),1,0)+IF(AND(ISNUMBER(FIND(Q$8,$H$65)),ISNUMBER(FIND($I15,$H$65))),1,0)+IF(AND(ISNUMBER(FIND(Q$8,$H$66)),ISNUMBER(FIND($I15,$H$66))),1,0)+IF(AND(ISNUMBER(FIND(Q$8,$H$67)),ISNUMBER(FIND($I15,$H$67))),1,0)+IF(AND(ISNUMBER(FIND(Q$8,$H$68)),ISNUMBER(FIND($I15,$H$68))),1,0)+IF(AND(ISNUMBER(FIND(Q$8,$H$69)),ISNUMBER(FIND($I15,$H$69))),1,0)+IF(AND(ISNUMBER(FIND(Q$8,$H$70)),ISNUMBER(FIND($I15,$H$70))),1,0)+IF(AND(ISNUMBER(FIND(Q$8,$H$71)),ISNUMBER(FIND($I15,$H$71))),1,0)+IF(AND(ISNUMBER(FIND(Q$8,$H$72)),ISNUMBER(FIND($I15,$H$72))),1,0)+IF(AND(ISNUMBER(FIND(Q$8,$H$73)),ISNUMBER(FIND($I15,$H$73))),1,0)+IF(AND(ISNUMBER(FIND(Q$8,$H$74)),ISNUMBER(FIND($I15,$H$74))),1,0)+IF(AND(ISNUMBER(FIND(Q$8,$H$75)),ISNUMBER(FIND($I15,$H$75))),1,0)+IF(AND(ISNUMBER(FIND(Q$8,$H$76)),ISNUMBER(FIND($I15,$H$76))),1,0)","v":4},3,5,4,5,4,5,5,4,6,5]
["R9",{"$f":"VLOOKUP(VALUE(MID($A16,2,2)),Bron!$A$2:$G$46,B$3+1,FALSE)","v":18},{"$f":"VLOOKUP(VALUE(MID($A16,2,2)),Bron!$A$2:$G$46,C$3+1,FALSE)","v":12},{"$f":"VLOOKUP(VALUE(MID($A16,2,2)),Bron!$A$2:$G$46,D$3+1,FALSE)","v":10},{"$f":"VLOOKUP(VALUE(MID($A16,2,2)),Bron!$A$2:$G$46,E$3+1,FALSE)","v":8},{"$f":"VLOOKUP(VALUE(MID($A16,2,2)),Bron!$A$2:$G$46,F$3+1,FALSE)","v":1},{"$f":"VLOOKUP(VALUE(MID($A16,2,2)),Bron!$A$2:$G$46,G$3+1,FALSE)","v":16},"18;12;10;08;01;16","08",{"$nulls":8},{"$f":"IF(AND(ISNUMBER(FIND(R$8,$H$4)),ISNUMBER(FIND($I16,$H$4))),1,0)+IF(AND(ISNUMBER(FIND(R$8,$H$5)),ISNUMBER(FIND($I16,$H$5))),1,0)+IF(AND(ISNUMBER(FIND(R$8,$H$6)),ISNUMBER(FIND($I16,$H$6))),1,0)+IF(AND(ISNUMBER(FIND(R$8,$H$7)),ISNUMBER(FIND($I16,$H$7))),1,0)+IF(AND(ISNUMBER(FIND(R$8,$H$8)),ISNUMBER(FIND($I16,$H$8))),1,0)+IF(AND(ISNUMBER(FIND(R$8,$H$9)),ISNUMBER(FIND($I16,$H$9))),1,0)+IF(AND(ISNUMBER(FIND(R$8,$H$10)),ISNUMBER(FIND($I16,$H$10))),1,0)+IF(AND(ISNUMBER(FIND(R$8,$H$11)),ISNUMBER(FIND($I16,$H$11))),1,0)+IF(AND(ISNUMBER(FIND(R$8,$H$12)),ISNUMBER(FIND($I16,$H$12))),1,0)+IF(AND(ISNUMBER(FIND(R$8,$H$13)),ISNUMBER(FIND($I16,$H$13))),1,0)+IF(AND(ISNUMBER(FIND(R$8,$H$14)),ISNUMBER(FIND($I16,$H$14))),1,0)+IF(AND(ISNUMBER(FIND(R$8,$H$15)),ISNUMBER(FIND($I16,$H$15))),1,0)+IF(AND(ISNUMBER(FIND(R$8,$H$16)),ISNUMBER(FIND($I16,$H$16))),1,0)+IF(AND(ISNUMBER(FIND(R$8,$H$17)),ISNUMBER(FIND($I16,$H$17))),1,0)+IF(AND(ISNUMBER(FIND(R$8,$H$18)),ISNUMBER(FIND($I16,$H$18))),1,0)+IF(AND(ISNUMBER(FIND(R$8,$H$19)),ISNUMBER(FIND($I16,$H$19))),1,0)+IF(AND(ISNUMBER(FIND(R$8,$H$20)),ISNUMBER(FIND($I16,$H$20))),1,0)+IF(AND(ISNUMBER(FIND(R$8,$H$21)),ISNUMBER(FIND($I16,$H$21))),1,0)+IF(AND(ISNUMBER(FIND(R$8,$H$22)),ISNUMBER(FIND($I16,$H$22))),1,0)+IF(AND(ISNUMBER(FIND(R$8,$H$23)),ISNUMBER(FIND($I16,$H$23))),1,0)+IF(AND(ISNUMBER(FIND(R$8,$H$24)),ISNUMBER(FIND($I16,$H$24))),1,0)+IF(AND(ISNUMBER(FIND(R$8,$H$25)),ISNUMBER(FIND($I16,$H$25))),1,0)+IF(AND(ISNUMBER(FIND(R$8,$H$26)),ISNUMBER(FIND($I16,$H$26))),1,0)+IF(AND(ISNUMBER(FIND(R$8,$H$27)),ISNUMBER(FIND($I16,$H$27))),1,0)+IF(AND(ISNUMBER(FIND(R$8,$H$28)),ISNUMBER(FIND($I16,$H$28))),1,0)+IF(AND(ISNUMBER(FIND(R$8,$H$29)),ISNUMBER(FIND($I16,$H$29))),1,0)+IF(AND(ISNUMBER(FIND(R$8,$H$30)),ISNUMBER(FIND($I16,$H$30))),1,0)+IF(AND(ISNUMBER(FIND(R$8,$H$31)),ISNUMBER(FIND($I16,$H$31))),1,0)+IF(AND(ISNUMBER(FIND(R$8,$H$32)),ISNUMBER(FIND($I16,$H$32))),1,0)+IF(AND(ISNUMBER(FIND(R$8,$H$33)),ISNUMBER(FIND($I16,$H$33))),1,0)+IF(AND(ISNUMBER(FIND(R$8,$H$34)),ISNUMBER(FIND($I16,$H$34))),1,0)+IF(AND(ISNUMBER(FIND(R$8,$H$35)),ISNUMBER(FIND($I16,$H$35))),1,0)+IF(AND(ISNUMBER(FIND(R$8,$H$36)),ISNUMBER(FIND($I16,$H$36))),1,0)+IF(AND(ISNUMBER(FIND(R$8,$H$37)),ISNUMBER(FIND($I16,$H$37))),1,0)+IF(AND(ISNUMBER(FIND(R$8,$H$38)),ISNUMBER(FIND($I16,$H$38))),1,0)+IF(AND(ISNUMBER(FIND(R$8,$H$39)),ISNUMBER(FIND($I16,$H$39))),1,0)+IF(AND(ISNUMBER(FIND(R$8,$H$40)),ISNUMBER(FIND($I16,$H$40))),1,0)+IF(AND(ISNUMBER(FIND(R$8,$H$41)),ISNUMBER(FIND($I16,$H$41))),1,0)+IF(AND(ISNUMBER(FIND(R$8,$H$42)),ISNUMBER(FIND($I16,$H$42))),1,0)+IF(AND(ISNUMBER(FIND(R$8,$H$43)),ISNUMBER(FIND($I16,$H$43))),1,0)+IF(AND(ISNUMBER(FIND(R$8,$H$44)),ISNUMBER(FIND($I16,$H$44))),1,0)+IF(AND(ISNUMBER(FIND(R$8,$H$45)),ISNUMBER(FIND($I16,$H$45))),1,0)+IF(AND(ISNUMBER(FIND(R$8,$H$46)),ISNUMBER(FIND($I16,$H$46))),1,0)+IF(AND(ISNUMBER(FIND(R$8,$H$47)),ISNUMBER(FIND($I16,$H$47))),1,0)+IF(AND(ISNUMBER(FIND(R$8,$H$48)),ISNUMBER(FIND($I16,$H$48))),1,0)+IF(AND(ISNUMBER(FIND(R$8,$H$49)),ISNUMBER(FIND($I16,$H$49))),1,0)+IF(AND(ISNUMBER(FIND(R$8,$H$50)),ISNUMBER(FIND($I16,$H$50))),1,0)+IF(AND(ISNUMBER(FIND(R$8,$H$51)),ISNUMBER(FIND($I16,$H$51))),1,0)+IF(AND(ISNUMBER(FIND(R$8,$H$52)),ISNUMBER(FIND($I16,$H$52))),1,0)+IF(AND(ISNUMBER(FIND(R$8,$H$53)),ISNUMBER(FIND($I16,$H$53))),1,0)+IF(AND(ISNUMBER(FIND(R$8,$H$54)),ISNUMBER(FIND($I16,$H$54))),1,0)+IF(AND(ISNUMBER(FIND(R$8,$H$55)),ISNUMBER(FIND($I16,$H$55))),1,0)+IF(AND(ISNUMBER(FIND(R$8,$H$56)),ISNUMBER(FIND($I16,$H$56))),1,0)+IF(AND(ISNUMBER(FIND(R$8,$H$57)),ISNUMBER(FIND($I16,$H$57))),1,0)+IF(AND(ISNUMBER(FIND(R$8,$H$58)),ISNUMBER(FIND($I16,$H$58))),1,0)+IF(AND(ISNUMBER(FIND(R$8,$H$59)),ISNUMBER(FIND($I16,$H$59))),1,0)+IF(AND(ISNUMBER(FIND(R$8,$H$60)),ISNUMBER(FIND($I16,$H$60))),1,0)+IF(AND(ISNUMBER(FIND(R$8,$H$61)),ISNUMBER(FIND($I16,$H$61))),1,0)+IF(AND(ISNUMBER(FIND(R$8,$H$62)),ISNUMBER(FIND($I16,$H$62))),1,0)+IF(AND(ISNUMBER(FIND(R$8,$H$63)),ISNUMBER(FIND($I16,$H$63))),1,0)+IF(AND(ISNUMBER(FIND(R$8,$H$64)),ISNUMBER(FIND($I16,$H$64))),1,0)+IF(AND(ISNUMBER(FIND(R$8,$H$65)),ISNUMBER(FIND($I16,$H$65))),1,0)+IF(AND(ISNUMBER(FIND(R$8,$H$66)),ISNUMBER(FIND($I16,$H$66))),1,0)+IF(AND(ISNUMBER(FIND(R$8,$H$67)),ISNUMBER(FIND($I16,$H$67))),1,0)+IF(AND(ISNUMBER(FIND(R$8,$H$68)),ISNUMBER(FIND($I16,$H$68))),1,0)+IF(AND(ISNUMBER(FIND(R$8,$H$69)),ISNUMBER(FIND($I16,$H$69))),1,0)+IF(AND(ISNUMBER(FIND(R$8,$H$70)),ISNUMBER(FIND($I16,$H$70))),1,0)+IF(AND(ISNUMBER(FIND(R$8,$H$71)),ISNUMBER(FIND($I16,$H$71))),1,0)+IF(AND(ISNUMBER(FIND(R$8,$H$72)),ISNUMBER(FIND($I16,$H$72))),1,0)+IF(AND(ISNUMBER(FIND(R$8,$H$73)),ISNUMBER(FIND($I16,$H$73))),1,0)+IF(AND(ISNUMBER(FIND(R$8,$H$74)),ISNUMBER(FIND($I16,$H$74))),1,0)+IF(AND(ISNUMBER(FIND(R$8,$H$75)),ISNUMBER(FIND($I16,$H$75))),1,0)+IF(AND(ISNUMBER(FIND(R$8,$H$76)),ISNUMBER(FIND($I16,$H$76))),1,0)","v":4},4,5,3,4,4,4,5,4,4]
["Flight 4",{"$nulls":7},"09",{"$nulls":9},{"$f":"IF(AND(ISNUMBER(FIND(S$8,$H$4)),ISNUMBER(FIND($I17,$H$4))),1,0)+IF(AND(ISNUMBER(FIND(S$8,$H$5)),ISNUMBER(FIND($I17,$H$5))),1,0)+IF(AND(ISNUMBER(FIND(S$8,$H$6)),ISNUMBER(FIND($I17,$H$6))),1,0)+IF(AND(ISNUMBER(FIND(S$8,$H$7)),ISNUMBER(FIND($I17,$H$7))),1,0)+IF(AND(ISNUMBER(FIND(S$8,$H$8)),ISNUMBER(FIND($I17,$H$8))),1,0)+IF(AND(ISNUMBER(FIND(S$8,$H$9)),ISNUMBER(FIND($I17,$H$9))),1,0)+IF(AND(ISNUMBER(FIND(S$8,$H$10)),ISNUMBER(FIND($I17,$H$10))),1,0)+IF(AND(ISNUMBER(FIND(S$8,$H$11)),ISNUMBER(FIND($I17,$H$11))),1,0)+IF(AND(ISNUMBER(FIND(S$8,$H$12)),ISNUMBER(FIND($I17,$H$12))),1,0)+IF(AND(ISNUMBER(FIND(S$8,$H$13)),ISNUMBER(FIND($I17,$H$13))),1,0)+IF(AND(ISNUMBER(FIND(S$8,$H$14)),ISNUMBER(FIND($I17,$H$14))),1,0)+IF(AND(ISNUMBER(FIND(S$8,$H$15)),ISNUMBER(FIND($I17,$H$15))),1,0)+IF(AND(ISNUMBER(FIND(S$8,$H$16)),ISNUMBER(FIND($I17,$H$16))),1,0)+IF(AND(ISNUMBER(FIND(S$8,$H$17)),ISNUMBER(FIND($I17,$H$17))),1,0)+IF(AND(ISNUMBER(FIND(S$8,$H$18)),ISNUMBER(FIND($I17,$H$18))),1,0)+IF(AND(ISNUMBER(FIND(S$8,$H$19)),ISNUMBER(FIND($I17,$H$19))),1,0)+IF(AND(ISNUMBER(FIND(S$8,$H$20)),ISNUMBER(FIND($I17,$H$20))),1,0)+IF(AND(ISNUMBER(FIND(S$8,$H$21)),ISNUMBER(FIND($I17,$H$21))),1,0)+IF(AND(ISNUMBER(FIND(S$8,$H$22)),ISNUMBER(FIND($I17,$H$22))),1,0)+IF(AND(ISNUMBER(FIND(S$8,$H$23)),ISNUMBER(FIND($I17,$H$23))),1,0)+IF(AND(ISNUMBER(FIND(S$8,$H$24)),ISNUMBER(FIND($I17,$H$24))),1,0)+IF(AND(ISNUMBER(FIND(S$8,$H$25)),ISNUMBER(FIND($I17,$H$25))),1,0)+IF(AND(ISNUMBER(FIND(S$8,$H$26)),ISNUMBER(FIND($I17,$H$26))),1,0)+IF(AND(ISNUMBER(FIND(S$8,$H$27)),ISNUMBER(FIND($I17,$H$27))),1,0)+IF(AND(ISNUMBER(FIND(S$8,$H$28)),ISNUMBER(FIND($I17,$H$28))),1,0)+IF(AND(ISNUMBER(FIND(S$8,$H$29)),ISNUMBER(FIND($I17,$H$29))),1,0)+IF(AND(ISNUMBER(FIND(S$8,$H$30)),ISNUMBER(FIND($I17,$H$30))),1,0)+IF(AND(ISNUMBER(FIND(S$8,$H$31)),ISNUMBER(FIND($I17,$H$31))),1,0)+IF(AND(ISNUMBER(FIND(S$8,$H$32)),ISNUMBER(FIND($I17,$H$32))),1,0)+IF(AND(ISNUMBER(FIND(S$8,$H$33)),ISNUMBER(FIND($I17,$H$33))),1,0)+IF(AND(ISNUMBER(FIND(S$8,$H$34)),ISNUMBER(FIND($I17,$H$34))),1,0)+IF(AND(ISNUMBER(FIND(S$8,$H$35)),ISNUMBER(FIND($I17,$H$35))),1,0)+IF(AND(ISNUMBER(FIND(S$8,$H$36)),ISNUMBER(FIND($I17,$H$36))),1,0)+IF(AND(ISNUMBER(FIND(S$8,$H$37)),ISNUMBER(FIND($I17,$H$37))),1,0)+IF(AND(ISNUMBER(FIND(S$8,$H$38)),ISNUMBER(FIND($I17,$H$38))),1,0)+IF(AND(ISNUMBER(FIND(S$8,$H$39)),ISNUMBER(FIND($I17,$H$39))),1,0)+IF(AND(ISNUMBER(FIND(S$8,$H$40)),ISNUMBER(FIND($I17,$H$40))),1,0)+IF(AND(ISNUMBER(FIND(S$8,$H$41)),ISNUMBER(FIND($I17,$H$41))),1,0)+IF(AND(ISNUMBER(FIND(S$8,$H$42)),ISNUMBER(FIND($I17,$H$42))),1,0)+IF(AND(ISNUMBER(FIND(S$8,$H$43)),ISNUMBER(FIND($I17,$H$43))),1,0)+IF(AND(ISNUMBER(FIND(S$8,$H$44)),ISNUMBER(FIND($I17,$H$44))),1,0)+IF(AND(ISNUMBER(FIND(S$8,$H$45)),ISNUMBER(FIND($I17,$H$45))),1,0)+IF(AND(ISNUMBER(FIND(S$8,$H$46)),ISNUMBER(FIND($I17,$H$46))),1,0)+IF(AND(ISNUMBER(FIND(S$8,$H$47)),ISNUMBER(FIND($I17,$H$47))),1,0)+IF(AND(ISNUMBER(FIND(S$8,$H$48)),ISNUMBER(FIND($I17,$H$48))),1,0)+IF(AND(ISNUMBER(FIND(S$8,$H$49)),ISNUMBER(FIND($I17,$H$49))),1,0)+IF(AND(ISNUMBER(FIND(S$8,$H$50)),ISNUMBER(FIND($I17,$H$50))),1,0)+IF(AND(ISNUMBER(FIND(S$8,$H$51)),ISNUMBER(FIND($I17,$H$51))),1,0)+IF(AND(ISNUMBER(FIND(S$8,$H$52)),ISNUMBER(FIND($I17,$H$52))),1,0)+IF(AND(ISNUMBER(FIND(S$8,$H$53)),ISNUMBER(FIND($I17,$H$53))),1,0)+IF(AND(ISNUMBER(FIND(S$8,$H$54)),ISNUMBER(FIND($I17,$H$54))),1,0)+IF(AND(ISNUMBER(FIND(S$8,$H$55)),ISNUMBER(FIND($I17,$H$55))),1,0)+IF(AND(ISNUMBER(FIND(S$8,$H$56)),ISNUMBER(FIND($I17,$H$56))),1,0)+IF(AND(ISNUMBER(FIND(S$8,$H$57)),ISNUMBER(FIND($I17,$H$57))),1,0)+IF(AND(ISNUMBER(FIND(S$8,$H$58)),ISNUMBER(FIND($I17,$H$58))),1,0)+IF(AND(ISNUMBER(FIND(S$8,$H$59)),ISNUMBER(FIND($I17,$H$59))),1,0)+IF(AND(ISNUMBER(FIND(S$8,$H$60)),ISNUMBER(FIND($I17,$H$60))),1,0)+IF(AND(ISNUMBER(FIND(S$8,$H$61)),ISNUMBER(FIND($I17,$H$61))),1,0)+IF(AND(ISNUMBER(FIND(S$8,$H$62)),ISNUMBER(FIND($I17,$H$62))),1,0)+IF(AND(ISNUMBER(FIND(S$8,$H$63)),ISNUMBER(FIND($I17,$H$63))),1,0)+IF(AND(ISNUMBER(FIND(S$8,$H$64)),ISNUMBER(FIND($I17,$H$64))),1,0)+IF(AND(ISNUMBER(FIND(S$8,$H$65)),ISNUMBER(FIND($I17,$H$65))),1,0)+IF(AND(ISNUMBER(FIND(S$8,$H$66)),ISNUMBER(FIND($I17,$H$66))),1,0)+IF(AND(ISNUMBER(FIND(S$8,$H$67)),ISNUMBER(FIND($I17,$H$67))),1,0)+IF(AND(ISNUMBER(FIND(S$8,$H$68)),ISNUMBER(FIND($I17,$H$68))),1,0)+IF(AND(ISNUMBER(FIND(S$8,$H$69)),ISNUMBER(FIND($I17,$H$69))),1,0)+IF(AND(ISNUMBER(FIND(S$8,$H$70)),ISNUMBER(FIND($I17,$H$70))),1,0)+IF(AND(ISNUMBER(FIND(S$8,$H$71)),ISNUMBER(FIND($I17,$H$71))),1,0)+IF(AND(ISNUMBER(FIND(S$8,$H$72)),ISNUMBER(FIND($I17,$H$72))),1,0)+IF(AND(ISNUMBER(FIND(S$8,$H$73)),ISNUMBER(FIND($I17,$H$73))),1,0)+IF(AND(ISNUMBER(FIND(S$8,$H$74)),ISNUMBER(FIND($I17,$H$74))),1,0)+IF(AND(ISNUMBER(FIND(S$8,$H$75)),ISNUMBER(FIND($I17,$H$75))),1,0)+IF(AND(ISNUMBER(FIND(S$8,$H$76)),ISNUMBER(FIND($I17,$H$76))),1,0)","v":4},5,5,3,5,6,4,3,4]
[null,1.0,2.0,3.0,4.0,5.0,6.0,null,"10",{"$nulls":10},{"$f":"IF(AND(ISNUMBER(FIND(T$8,$H$4)),ISNUMBER(FIND($I18,$H$4))),1,0)+IF(AND(ISNUMBER(FIND(T$8,$H$5)),ISNUMBER(FIND($I18,$H$5))),1,0)+IF(AND(ISNUMBER(FIND(T$8,$H$6)),ISNUMBER(FIND($I18,$H$6))),1,0)+IF(AND(ISNUMBER(FIND(T$8,$H$7)),ISNUMBER(FIND($I18,$H$7))),1,0)+IF(AND(ISNUMBER(FIND(T$8,$H$8)),ISNUMBER(FIND($I18,$H$8))),1,0)+IF(AND(ISNUMBER(FIND(T$8,$H$9)),ISNUMBER(FIND($I18,$H$9))),1,0)+IF(AND(ISNUMBER(FIND(T$8,$H$10)),ISNUMBER(FIND($I18,$H$10))),1,0)+IF(AND(ISNUMBER(FIND(T$8,$H$11)),ISNUMBER(FIND($I18,$H$11))),1,0)+IF(AND(ISNUMBER(FIND(T$8,$H$12)),ISNUMBER(FIND($I18,$H$12))),1,0)+IF(AND(ISNUMBER(FIND(T$8,$H$13)),ISNUMBER(FIND($I18,$H$13))),1,0)+IF(AND(ISNUMBER(FIND(T$8,$H$14)),ISNUMBER(FIND($I18,$H$14))),1,0)+IF(AND(ISNUMBER(FIND(T$8,$H$15)),ISNUMBER(FIND($I18,$H$15))),1,0)+IF(AND(ISNUMBER(FIND(T$8,$H$16)),ISNUMBER(FIND($I18,$H$16))),1,0)+IF(AND(ISNUMBER(FIND(T$8,$H$17)),ISNUMBER(FIND($I18,$H$17))),1,0)+IF(AND(ISNUMBER(FIND(T$8,$H$18)),ISNUMBER(FIND($I18,$H$18))),1,0)+IF(AND(ISNUMBER(FIND(T$8,$H$19)),ISNUMBER(FIND($I18,$H$19))),1,0)+IF(AND(ISNUMBER(FIND(T$8,$H$20)),ISNUMBER(FIND($I18,$H$20))),1,0)+IF(AND(ISNUMBER(FIND(T$8,$H$21)),ISNUMBER(FIND($I18,$H$21))),1,0)+IF(AND(ISNUMBER(FIND(T$8,$H$22)),ISNUMBER(FIND($I18,$H$22))),1,0)+IF(AND(ISNUMBER(FIND(T$8,$H$23)),ISNUMBER(FIND($I18,$H$23))),1,0)+IF(AND(ISNUMBER(FIND(T$8,$H$24)),ISNUMBER(FIND($I18,$H$24))),1,0)+IF(AND(ISNUMBER(FIND(T$8,$H$25)),ISNUMBER(FIND($I18,$H$25))),1,0)+IF(AND(ISNUMBER(FIND(T$8,$H$26)),ISNUMBER(FIND($I18,$H$26))),1,0)+IF(AND(ISNUMBER(FIND(T$8,$H$27)),ISNUMBER(FIND($I18,$H$27))),1,0)+IF(AND(ISNUMBER(FIND(T$8,$H$28)),ISNUMBER(FIND($I18,$H$28))),1,0)+IF(AND(ISNUMBER(FIND(T$8,$H$29)),ISNUMBER(FIND($I18,$H$29))),1,0)+IF(AND(ISNUMBER(FIND(T$8,$H$30)),ISNUMBER(FIND($I18,$H$30))),1,0)+IF(AND(ISNUMBER(FIND(T$8,$H$31)),ISNUMBER(FIND($I18,$H$31))),1,0)+IF(AND(ISNUMBER(FIND(T$8,$H$32)),ISNUMBER(FIND($I18,$H$32))),1,0)+IF(AND(ISNUMBER(FIND(T$8,$H$33)),ISNUMBER(FIND($I18,$H$33))),1,0)+IF(AND(ISNUMBER(FIND(T$8,$H$34)),ISNUMBER(FIND($I18,$H$34))),1,0)+IF(AND(ISNUMBER(FIND(T$8,$H$35)),ISNUMBER(FIND($I18,$H$35))),1,0)+IF(AND(ISNUMBER(FIND(T$8,$H$36)),ISNUMBER(FIND($I18,$H$36))),1,0)+IF(AND(ISNUMBER(FIND(T$8,$H$37)),ISNUMBER(FIND($I18,$H$37))),1,0)+IF(AND(ISNUMBER(FIND(T$8,$H$38)),ISNUMBER(FIND($I18,$H$38))),1,0)+IF(AND(ISNUMBER(FIND(T$8,$H$39)),ISNUMBER(FIND($I18,$H$39))),1,0)+IF(AND(ISNUMBER(FIND(T$8,$H$40)),ISNUMBER(FIND($I18,$H$40))),1,0)+IF(AND(ISNUMBER(FIND(T$8,$H$41)),ISNUMBER(FIND($I18,$H$41))),1,0)+IF(AND(ISNUMBER(FIND(T$8,$H$42)),ISNUMBER(FIND($I18,$H$42))),1,0)+IF(AND(ISNUMBER(FIND(T$8,$H$43)),ISNUMBER(FIND($I18,$H$43))),1,0)+IF(AND(ISNUMBER(FIND(T$8,$H$44)),ISNUMBER(FIND($I18,$H$44))),1,0)+IF(AND(ISNUMBER(FIND(T$8,$H$45)),ISNUMBER(FIND($I18,$H$45))),1,0)+IF(AND(ISNUMBER(FIND(T$8,$H$46)),ISNUMBER(FIND($I18,$H$46))),1,0)+IF(AND(ISNUMBER(FIND(T$8,$H$47)),ISNUMBER(FIND($I18,$H$47))),1,0)+IF(AND(ISNUMBER(FIND(T$8,$H$48)),ISNUMBER(FIND($I18,$H$48))),1,0)+IF(AND(ISNUMBER(FIND(T$8,$H$49)),ISNUMBER(FIND($I18,$H$49))),1,0)+IF(AND(ISNUMBER(FIND(T$8,$H$50)),ISNUMBER(FIND($I18,$H$50))),1,0)+IF(AND(ISNUMBER(FIND(T$8,$H$51)),ISNUMBER(FIND($I18,$H$51))),1,0)+IF(AND(ISNUMBER(FIND(T$8,$H$52)),ISNUMBER(FIND($I18,$H$52))),1,0)+IF(AND(ISNUMBER(FIND(T$8,$H$53)),ISNUMBER(FIND($I18,$H$53))),1,0)+IF(AND(ISNUMBER(FIND(T$8,$H$54)),ISNUMBER(FIND($I18,$H$54))),1,0)+IF(AND(ISNUMBER(FIND(T$8,$H$55)),ISNUMBER(FIND($I18,$H$55))),1,0)+IF(AND(ISNUMBER(FIND(T$8,$H$56)),ISNUMBER(FIND($I18,$H$56))),1,0)+IF(AND(ISNUMBER(FIND(T$8,$H$57)),ISNUMBER(FIND($I18,$H$57))),1,0)+IF(AND(ISNUMBER(FIND(T$8,$H$58)),ISNUMBER(FIND($I18,$H$58))),1,0)+IF(AND(ISNUMBER(FIND(T$8,$H$59)),ISNUMBER(FIND($I18,$H$59))),1,0)+IF(AND(ISNUMBER(FIND(T$8,$H$60)),ISNUMBER(FIND($I18,$H$60))),1,0)+IF(AND(ISNUMBER(FIND(T$8,$H$61)),ISNUMBER(FIND($I18,$H$61))),1,0)+IF(AND(ISNUMBER(FIND(T$8,$H$62)),ISNUMBER(FIND($I18,$H$62))),1,0)+IF(AND(ISNUMBER(FIND(T$8,$H$63)),ISNUMBER(FIND($I18,$H$63))),1,0)+IF(AND(ISNUMBER(FIND(T$8,$H$64)),ISNUMBER(FIND($I18,$H$64))),1,0)+IF(AND(ISNUMBER(FIND(T$8,$H$65)),ISNUMBER(FIND($I18,$H$65))),1,0)+IF(AND(ISNUMBER(FIND(T$8,$H$66)),ISNUMBER(FIND($I18,$H$66))),1,0)+IF(AND(ISNUMBER(FIND(T$8,$H$67)),ISNUMBER(FIND($I18,$H$67))),1,0)+IF(AND(ISNUMBER(FIND(T$8,$H$68)),ISNUMBER(FIND($I18,$H$68))),1,0)+IF(AND(ISNUMBER(FIND(T$8,$H$69)),ISNUMBER(FIND($I18,$H$69))),1,0)+IF(AND(ISNUMBER(FIND(T$8,$H$70)),ISNUMBER(FIND($I18,$H$70))),1,0)+IF(AND(ISNUMBER(FIND(T$8,$H$71)),ISNUMBER(FIND($I18,$H$71))),1,0)+IF(AND(ISNUMBER(FIND(T$8,$H$72)),ISNUMBER(FIND($I18,$H$72))),1,0)+IF(AND(ISNUMBER(FIND(T$8,$H$73)),ISNUMBER(FIND($I18,$H$73))),1,0)+IF(AND(ISNUMBER(FIND(T$8,$H$74)),ISNUMBER(FIND($I18,$H$74))),1,0)+IF(AND(ISNUMBER(FIND(T$8,$H$75)),ISNUMBER(FIND($I18,$H$75))),1,0)+IF(AND(ISNUMBER(FIND(T$8,$H$76)),ISNUMBER(FIND($I18,$H$76))),1,0)","v":5},5,6,4,4,4,5,4]
["R10",{"$f":"VLOOKUP(VALUE(MID($A19,2,2)),Bron!$A$2:$G$46,B$3+1,FALSE)","v":7},{"$f":"VLOOKUP(VALUE(MID($A19,2,2)),Bron!$A$2:$G$46,C$3+1,FALSE)","v":9},{"$f":"VLOOKUP(VALUE(MID($A19,2,2)),Bron!$A$2:$G$46,D$3+1,FALSE)","v":17},{"$f":"VLOOKUP(VALUE(MID($A19,2,2)),Bron!$A$2:$G$46,E$3+1,FALSE)","v":8},{"$f":"VLOOKUP(VALUE(MID($A19,2,2)),Bron!$A$2:$G$46,F$3+1,FALSE)","v":3},{"$f":"VLOOKUP(VALUE(MID($A19,2,2)),Bron!$A$2:$G$46,G$3+1,FALSE)","v":16},{"$f":"TEXT(B19,\"00\")&\";\"&TEXT(C19,\"00\")&\";\"&TEXT(D19,\"00\")&\";\"&TEXT(E19,\"00\")&\";\"&TEXT(F19,\"00\")&\";\"&TEXT(G19,\"00\")","v":"07;09;17;08;03;16"},"11",{"$nulls":11},{"$f":"IF(AND(ISNUMBER(FIND(U$8,$H$4)),ISNUMBER(FIND($I19,$H$4))),1,0)+IF(AND(ISNUMBER(FIND(U$8,$H$5)),ISNUMBER(FIND($I19,$H$5))),1,0)+IF(AND(ISNUMBER(FIND(U$8,$H$6)),ISNUMBER(FIND($I19,$H$6))),1,0)+IF(AND(ISNUMBER(FIND(U$8,$H$7)),ISNUMBER(FIND($I19,$H$7))),1,0)+IF(AND(ISNUMBER(FIND(U$8,$H$8)),ISNUMBER(FIND($I19,$H$8))),1,0)+IF(AND(ISNUMBER(FIND(U$8,$H$9)),ISNUMBER(FIND($I19,$H$9))),1,0)+IF(AND(ISNUMBER(FIND(U$8,$H$10)),ISNUMBER(FIND($I19,$H$10))),1,0)+IF(AND(ISNUMBER(FIND(U$8,$H$11)),ISNUMBER(FIND($I19,$H$11))),1,0)+IF(AND(ISNUMBER(FIND(U$8,$H$12)),ISNUMBER(FIND($I19,$H$12))),1,0)+IF(AND(ISNUMBER(FIND(U$8,$H$13)),ISNUMBER(FIND($I19,$H$13))),1,0)+IF(AND(ISNUMBER(FIND(U$8,$H$14)),ISNUMBER(FIND($I19,$H$14))),1,0)+IF(AND(ISNUMBER(FIND(U$8,$H$15)),ISNUMBER(FIND($I19,$H$15))),1,0)+IF(AND(ISNUMBER(FIND(U$8,$H$16)),ISNUMBER(FIND($I19,$H$16))),1,0)+IF(AND(ISNUMBER(FIND(U$8,$H$17)),ISNUMBER(FIND($I19,$H$17))),1,0)+IF(AND(ISNUMBER(FIND(U$8,$H$18)),ISNUMBER(FIND($I19,$H$18))),1,0)+IF(AND(ISNUMBER(FIND(U$8,$H$19)),ISNUMBER(FIND($I19,$H$19))),1,0)+IF(AND(ISNUMBER(FIND(U$8,$H$20)),ISNUMBER(FIND($I19,$H$20))),1,0)+IF(AND(ISNUMBER(FIND(U$8,$H$21)),ISNUMBER(FIND($I19,$H$21))),1,0)+IF(AND(ISNUMBER(FIND(U$8,$H$22)),ISNUMBER(FIND($I19,$H$22))),1,0)+IF(AND(ISNUMBER(FIND(U$8,$H$23)),ISNUMBER(FIND($I19,$H$23))),1,0)+IF(AND(ISNUMBER(FIND(U$8,$H$24)),ISNUMBER(FIND($I19,$H$24))),1,0)+IF(AND(ISNUMBER(FIND(U$8,$H$25)),ISNUMBER(FIND($I19,$H$25))),1,0)+IF(AND(ISNUMBER(FIND(U$8,$H$26)),ISNUMBER(FIND($I19,$H$26))),1,0)+IF(AND(ISNUMBER(FIND(U$8,$H$27)),ISNUMBER(FIND($I19,$H$27))),1,0)+IF(AND(ISNUMBER(FIND(U$8,$H$28)),ISNUMBER(FIND($I19,$H$28))),1,0)+IF(AND(ISNUMBER(FIND(U$8,$H$29)),ISNUMBER(FIND($I19,$H$29))),1,0)+IF(AND(ISNUMBER(FIND(U$8,$H$30)),ISNUMBER(FIND($I19,$H$30))),1,0)+IF(AND(ISNUMBER(FIND(U$8,$H$31)),ISNUMBER(FIND($I19,$H$31))),1,0)+IF(AND(ISNUMBER(FIND(U$8,$H$32)),ISNUMBER(FIND($I19,$H$32))),1,0)+IF(AND(ISNUMBER(FIND(U$8,$H$33)),ISNUMBER(FIND($I19,$H$33))),1,0)+IF(AND(ISNUMBER(FIND(U$8,$H$34)),ISNUMBER(FIND($I19,$H$34))),1,0)+IF(AND(ISNUMBER(FIND(U$8,$H$35)),ISNUMBER(FIND($I19,$H$35))),1,0)+IF(AND(ISNUMBER(FIND(U$8,$H$36)),ISNUMBER(FIND($I19,$H$36))),1,0)+IF(AND(ISNUMBER(FIND(U$8,$H$37)),ISNUMBER(FIND($I19,$H$37))),1,0)+IF(AND(ISNUMBER(FIND(U$8,$H$38)),ISNUMBER(FIND($I19,$H$38))),1,0)+IF(AND(ISNUMBER(FIND(U$8,$H$39)),ISNUMBER(FIND($I19,$H$39))),1,0)+IF(AND(ISNUMBER(FIND(U$8,$H$40)),ISNUMBER(FIND($I19,$H$40))),1,0)+IF(AND(ISNUMBER(FIND(U$8,$H$41)),ISNUMBER(FIND($I19,$H$41))),1,0)+IF(AND(ISNUMBER(FIND(U$8,$H$42)),ISNUMBER(FIND($I19,$H$42))),1,0)+IF(AND(ISNUMBER(FIND(U$8,$H$43)),ISNUMBER(FIND($I19,$H$43))),1,0)+IF(AND(ISNUMBER(FIND(U$8,$H$44)),ISNUMBER(FIND($I19,$H$44))),1,0)+IF(AND(ISNUMBER(FIND(U$8,$H$45)),ISNUMBER(FIND($I19,$H$45))),1,0)+IF(AND(ISNUMBER(FIND(U$8,$H$46)),ISNUMBER(FIND($I19,$H$46))),1,0)+IF(AND(ISNUMBER(FIND(U$8,$H$47)),ISNUMBER(FIND($I19,$H$47))),1,0)+IF(AND(ISNUMBER(FIND(U$8,$H$48)),ISNUMBER(FIND($I19,$H$48))),1,0)+IF(AND(ISNUMBER(FIND(U$8,$H$49)),ISNUMBER(FIND($I19,$H$49))),1,0)+IF(AND(ISNUMBER(FIND(U$8,$H$50)),ISNUMBER(FIND($I19,$H$50))),1,0)+IF(AND(ISNUMBER(FIND(U$8,$H$51)),ISNUMBER(FIND($I19,$H$51))),1,0)+IF(AND(ISNUMBER(FIND(U$8,$H$52)),ISNUMBER(FIND($I19,$H$52))),1,0)+IF(AND(ISNUMBER(FIND(U$8,$H$53)),ISNUMBER(FIND($I19,$H$53))),1,0)+IF(AND(ISNUMBER(FIND(U$8,$H$54)),ISNUMBER(FIND($I19,$H$54))),1,0)+IF(AND(ISNUMBER(FIND(U$8,$H$55)),ISNUMBER(FIND($I19,$H$55))),1,0)+IF(AND(ISNUMBER(FIND(U$8,$H$56)),ISNUMBER(FIND($I19,$H$56))),1,0)+IF(AND(ISNUMBER(FIND(U$8,$H$57)),ISNUMBER(FIND($I19,$H$57))),1,0)+IF(AND(ISNUMBER(FIND(U$8,$H$58)),ISNUMBER(FIND($I19,$H$58))),1,0)+IF(AND(ISNUMBER(FIND(U$8,$H$59)),ISNUMBER(FIND($I19,$H$59))),1,0)+IF(AND(ISNUMBER(FIND(U$8,$H$60)),ISNUMBER(FIND($I19,$H$60))),1,0)+IF(AND(ISNUMBER(FIND(U$8,$H$61)),ISNUMBER(FIND($I19,$H$61))),1,0)+IF(AND(ISNUMBER(FIND(U$8,$H$62)),ISNUMBER(FIND($I19,$H$62))),1,0)+IF(AND(ISNUMBER(FIND(U$8,$H$63)),ISNUMBER(FIND($I19,$H$63))),1,0)+IF(AND(ISNUMBER(FIND(U$8,$H$64)),ISNUMBER(FIND($I19,$H$64))),1,0)+IF(AND(ISNUMBER(FIND(U$8,$H$65)),ISNUMBER(FIND($I19,$H$65))),1,0)+IF(AND(ISNUMBER(FIND(U$8,$H$66)),ISNUMBER(FIND($I19,$H$66))),1,0)+IF(AND(ISNUMBER(FIND(U$8,$H$67)),ISNUMBER(FIND($I19,$H$67))),1,0)+IF(AND(ISNUMBER(FIND(U$8,$H$68)),ISNUMBER(FIND($I19,$H$68))),1,0)+IF(AND(ISNUMBER(FIND(U$8,$H$69)),ISNUMBER(FIND($I19,$H$69))),1,0)+IF(AND(ISNUMBER(FIND(U$8,$H$70)),ISNUMBER(FIND($I19,$H$70))),1,0)+IF(AND(ISNUMBER(FIND(U$8,$H$71)),ISNUMBER(FIND($I19,$H$71))),1,0)+IF(AND(ISNUMBER(FIND(U$8,$H$72)),ISNUMBER(FIND($I19,$H$72))),1,0)+IF(AND(ISNUMBER(FIND(U$8,$H$73)),ISNUMBER(FIND($I19,$H$73))),1,0)+IF(AND(ISNUMBER(FIND(U$8,$H$74)),ISNUMBER(FIND($I19,$H$74))),1,0)+IF(AND(ISNUMBER(FIND(U$8,$H$75)),ISNUMBER(FIND($I19,$H$75))),1,0)+IF(AND(ISNUMBER(FIND(U$8,$H$76)),ISNUMBER(FIND($I19,$H$76))),1,0)","v":4},5,3,5,4,6,4]
["R11",{"$f":"VLOOKUP(VALUE(MID($A20,2,2)),Bron!$A$2:$G$46,B$3+1,FALSE)","v":18},{"$f":"VLOOKUP(VALUE(MID($A20,2,2)),Bron!$A$2:$G$46,C$3+1,FALSE)","v":2},{"$f":"VLOOKUP(VALUE(MID($A20,2,2)),Bron!$A$2:$G$46,D$3+1,FALSE)","v":4},{"$f":"VLOOKUP(VALUE(MID($A20,2,2)),Bron!$A$2:$G$46,E$3+1,FALSE)","v":15},{"$f":"VLOOKUP(VALUE(MID($A20,2,2)),Bron!$A$2:$G$46,F$3+1,FALSE)","v":13},{"$f":"VLOOKUP(VALUE(MID($A20,2,2)),Bron!$A$2:$G$46,G$3+1,FALSE)","v":10},"18;02;04;15;13;10","12",{"$nulls":12},{"$f":"IF(AND(ISNUMBER(FIND(V$8,$H$4)),ISNUMBER(FIND($I20,$H$4))),1,0)+IF(AND(ISNUMBER(FIND(V$8,$H$5)),ISNUMBER(FIND($I20,$H$5))),1,0)+IF(AND(ISNUMBER(FIND(V$8,$H$6)),ISNUMBER(FIND($I20,$H$6))),1,0)+IF(AND(ISNUMBER(FIND(V$8,$H$7)),ISNUMBER(FIND($I20,$H$7))),1,0)+IF(AND(ISNUMBER(FIND(V$8,$H$8)),ISNUMBER(FIND($I20,$H$8))),1,0)+IF(AND(ISNUMBER(FIND(V$8,$H$9)),ISNUMBER(FIND($I20,$H$9))),1,0)+IF(AND(ISNUMBER(FIND(V$8,$H$10)),ISNUMBER(FIND($I20,$H$10))),1,0)+IF(AND(ISNUMBER(FIND(V$8,$H$11)),ISNUMBER(FIND($I20,$H$11))),1,0)+IF(AND(ISNUMBER(FIND(V$8,$H$12)),ISNUMBER(FIND($I20,$H$12))),1,0)+IF(AND(ISNUMBER(FIND(V$8,$H$13)),ISNUMBER(FIND($I20,$H$13))),1,0)+IF(AND(ISNUMBER(FIND(V$8,$H$14)),ISNUMBER(FIND($I20,$H$14))),1,0)+IF(AND(ISNUMBER(FIND(V$8,$H$15)),ISNUMBER(FIND($I20,$H$15))),1,0)+IF(AND(ISNUMBER(FIND(V$8,$H$16)),ISNUMBER(FIND($I20,$H$16))),1,0)+IF(AND(ISNUMBER(FIND(V$8,$H$17)),ISNUMBER(FIND($I20,$H$17))),1,0)+IF(AND(ISNUMBER(FIND(V$8,$H$18)),ISNUMBER(FIND($I20,$H$18))),1,0)+IF(AND(ISNUMBER(FIND(V$8,$H$19)),ISNUMBER(FIND($I20,$H$19))),1,0)+IF(AND(ISNUMBER(FIND(V$8,$H$20)),ISNUMBER(FIND($I20,$H$20))),1,0)+IF(AND(ISNUMBER(FIND(V$8,$H$21)),ISNUMBER(FIND($I20,$H$21))),1,0)+IF(AND(ISNUMBER(FIND(V$8,$H$22)),ISNUMBER(FIND($I20,$H$22))),1,0)+IF(AND(ISNUMBER(FIND(V$8,$H$23)),ISNUMBER(FIND($I20,$H$23))),1,0)+IF(AND(ISNUMBER(FIND(V$8,$H$24)),ISNUMBER(FIND($I20,$H$24))),1,0)+IF(AND(ISNUMBER(FIND(V$8,$H$25)),ISNUMBER(FIND($I20,$H$25))),1,0)+IF(AND(ISNUMBER(FIND(V$8,$H$26)),ISNUMBER(FIND($I20,$H$26))),1,0)+IF(AND(ISNUMBER(FIND(V$8,$H$27)),ISNUMBER(FIND($I20,$H$27))),1,0)+IF(AND(ISNUMBER(FIND(V$8,$H$28)),ISNUMBER(FIND($I20,$H$28))),1,0)+IF(AND(ISNUMBER(FIND(V$8,$H$29)),ISNUMBER(FIND($I20,$H$29))),1,0)+IF(AND(ISNUMBER(FIND(V$8,$H$30)),ISNUMBER(FIND($I20,$H$30))),1,0)+IF(AND(ISNUMBER(FIND(V$8,$H$31)),ISNUMBER(FIND($I20,$H$31))),1,0)+IF(AND(ISNUMBER(FIND(V$8,$H$32)),ISNUMBER(FIND($I20,$H$32))),1,0)+IF(AND(ISNUMBER(FIND(V$8,$H$33)),ISNUMBER(FIND($I20,$H$33))),1,0)+IF(AND(ISNUMBER(FIND(V$8,$H$34)),ISNUMBER(FIND($I20,$H$34))),1,0)+IF(AND(ISNUMBER(FIND(V$8,$H$35)),ISNUMBER(FIND($I20,$H$35))),1,0)+IF(AND(ISNUMBER(FIND(V$8,$H$36)),ISNUMBER(FIND($I20,$H$36))),1,0)+IF(AND(ISNUMBER(FIND(V$8,$H$37)),ISNUMBER(FIND($I20,$H$37))),1,0)+IF(AND(ISNUMBER(FIND(V$8,$H$38)),ISNUMBER(FIND($I20,$H$38))),1,0)+IF(AND(ISNUMBER(FIND(V$8,$H$39)),ISNUMBER(FIND($I20,$H$39))),1,0)+IF(AND(ISNUMBER(FIND(V$8,$H$40)),ISNUMBER(FIND($I20,$H$40))),1,0)+IF(AND(ISNUMBER(FIND(V$8,$H$41)),ISNUMBER(FIND($I20,$H$41))),1,0)+IF(AND(ISNUMBER(FIND(V$8,$H$42)),ISNUMBER(FIND($I20,$H$42))),1,0)+IF(AND(ISNUMBER(FIND(V$8,$H$43)),ISNUMBER(FIND($I20,$H$43))),1,0)+IF(AND(ISNUMBER(FIND(V$8,$H$44)),ISNUMBER(FIND($I20,$H$44))),1,0)+IF(AND(ISNUMBER(FIND(V$8,$H$45)),ISNUMBER(FIND($I20,$H$45))),1,0)+IF(AND(ISNUMBER(FIND(V$8,$H$46)),ISNUMBER(FIND($I20,$H$46))),1,0)+IF(AND(ISNUMBER(FIND(V$8,$H$47)),ISNUMBER(FIND($I20,$H$47))),1,0)+IF(AND(ISNUMBER(FIND(V$8,$H$48)),ISNUMBER(FIND($I20,$H$48))),1,0)+IF(AND(ISNUMBER(FIND(V$8,$H$49)),ISNUMBER(FIND($I20,$H$49))),1,0)+IF(AND(ISNUMBER(FIND(V$8,$H$50)),ISNUMBER(FIND($I20,$H$50))),1,0)+IF(AND(ISNUMBER(FIND(V$8,$H$51)),ISNUMBER(FIND($I20,$H$51))),1,0)+IF(AND(ISNUMBER(FIND(V$8,$H$52)),ISNUMBER(FIND($I20,$H$52))),1,0)+IF(AND(ISNUMBER(FIND(V$8,$H$53)),ISNUMBER(FIND($I20,$H$53))),1,0)+IF(AND(ISNUMBER(FIND(V$8,$H$54)),ISNUMBER(FIND($I20,$H$54))),1,0)+IF(AND(ISNUMBER(FIND(V$8,$H$55)),ISNUMBER(FIND($I20,$H$55))),1,0)+IF(AND(ISNUMBER(FIND(V$8,$H$56)),ISNUMBER(FIND($I20,$H$56))),1,0)+IF(AND(ISNUMBER(FIND(V$8,$H$57)),ISNUMBER(FIND($I20,$H$57))),1,0)+IF(AND(ISNUMBER(FIND(V$8,$H$58)),ISNUMBER(FIND($I20,$H$58))),1,0)+IF(AND(ISNUMBER(FIND(V$8,$H$59)),ISNUMBER(FIND($I20,$H$59))),1,0)+IF(AND(ISNUMBER(FIND(V$8,$H$60)),ISNUMBER(FIND($I20,$H$60))),1,0)+IF(AND(ISNUMBER(FIND(V$8,$H$61)),ISNUMBER(FIND($I20,$H$61))),1,0)+IF(AND(ISNUMBER(FIND(V$8,$H$62)),ISNUMBER(FIND($I20,$H$62))),1,0)+IF(AND(ISNUMBER(FIND(V$8,$H$63)),ISNUMBER(FIND($I20,$H$63))),1,0)+IF(AND(ISNUMBER(FIND(V$8,$H$64)),ISNUMBER(FIND($I20,$H$64))),1,0)+IF(AND(ISNUMBER(FIND(V$8,$H$65)),ISNUMBER(FIND($I20,$H$65))),1,0)+IF(AND(ISNUMBER(FIND(V$8,$H$66)),ISNUMBER(FIND($I20,$H$66))),1,0)+IF(AND(ISNUMBER(FIND(V$8,$H$67)),ISNUMBER(FIND($I20,$H$67))),1,0)+IF(AND(ISNUMBER(FIND(V$8,$H$68)),ISNUMBER(FIND($I20,$H$68))),1,0)+IF(AND(ISNUMBER(FIND(V$8,$H$69)),ISNUMBER(FIND($I20,$H$69))),1,0)+IF(AND(ISNUMBER(FIND(V$8,$H$70)),ISNUMBER(FIND($I20,$H$70))),1,0)+IF(AND(ISNUMBER(FIND(V$8,$H$71)),ISNUMBER(FIND($I20,$H$71))),1,0)+IF(AND(ISNUMBER(FIND(V$8,$H$72)),ISNUMBER(FIND($I20,$H$72))),1,0)+IF(AND(ISNUMBER(FIND(V$8,$H$73)),ISNUMBER(FIND($I20,$H$73))),1,0)+IF(AND(ISNUMBER(FIND(V$8,$H$74)),ISNUMBER(FIND($I20,$H$74))),1,0)+IF(AND(ISNUMBER(FIND(V$8,$H$75)),ISNUMBER(FIND($I20,$H$75))),1,0)+IF(AND(ISNUMBER(FIND(V$8,$H$76)),ISNUMBER(FIND($I20,$H$76))),1,0)","v":5},4,3,4,4,6]
["R12",{"$f":"VLOOKUP(VALUE(MID($A21,2,2)),Bron!$A$2:$G$46,B$3+1,FALSE)","v":1},{"$f":"VLOOKUP(VALUE(MID($A21,2,2)),Bron!$A$2:$G$46,C$3+1,FALSE)","v":6},{"$f":"VLOOKUP(VALUE(MID($A21,2,2)),Bron!$A$2:$G$46,D$3+1,FALSE)","v":12},{"$f":"VLOOKUP(VALUE(MID($A21,2,2)),Bron!$A$2:$G$46,E$3+1,FALSE)","v":5},{"$f":"VLOOKUP(VALUE(MID($A21,2,2)),Bron!$A$2:$G$46,F$3+1,FALSE)","v":14},{"$f":"VLOOKUP(VALUE(MID($A21,2,2)),Bron!$A$2:$G$46,G$3+1,FALSE)","v":11},"01;06;12;05;14;11","13",{"$nulls":13},{"$f":"IF(AND(ISNUMBER(FIND(W$8,$H$4)),ISNUMBER(FIND($I21,$H$4))),1,0)+IF(AND(ISNUMBER(FIND(W$8,$H$5)),ISNUMBER(FIND($I21,$H$5))),1,0)+IF(AND(ISNUMBER(FIND(W$8,$H$6)),ISNUMBER(FIND($I21,$H$6))),1,0)+IF(AND(ISNUMBER(FIND(W$8,$H$7)),ISNUMBER(FIND($I21,$H$7))),1,0)+IF(AND(ISNUMBER(FIND(W$8,$H$8)),ISNUMBER(FIND($I21,$H$8))),1,0)+IF(AND(ISNUMBER(FIND(W$8,$H$9)),ISNUMBER(FIND($I21,$H$9))),1,0)+IF(AND(ISNUMBER(FIND(W$8,$H$10)),ISNUMBER(FIND($I21,$H$10))),1,0)+IF(AND(ISNUMBER(FIND(W$8,$H$11)),ISNUMBER(FIND($I21,$H$11))),1,0)+IF(AND(ISNUMBER(FIND(W$8,$H$12)),ISNUMBER(FIND($I21,$H$12))),1,0)+IF(AND(ISNUMBER(FIND(W$8,$H$13)),ISNUMBER(FIND($I21,$H$13))),1,0)+IF(AND(ISNUMBER(FIND(W$8,$H$14)),ISNUMBER(FIND($I21,$H$14))),1,0)+IF(AND(ISNUMBER(FIND(W$8,$H$15)),ISNUMBER(FIND($I21,$H$15))),1,0)+IF(AND(ISNUMBER(FIND(W$8,$H$16)),ISNUMBER(FIND($I21,$H$16))),1,0)+IF(AND(ISNUMBER(FIND(W$8,$H$17)),ISNUMBER(FIND($I21,$H$17))),1,0)+IF(AND(ISNUMBER(FIND(W$8,$H$18)),ISNUMBER(FIND($I21,$H$18))),1,0)+IF(AND(ISNUMBER(FIND(W$8,$H$19)),ISNUMBER(FIND($I21,$H$19))),1,0)+IF(AND(ISNUMBER(FIND(W$8,$H$20)),ISNUMBER(FIND($I21,$H$20))),1,0)+IF(AND(ISNUMBER(FIND(W$8,$H$21)),ISNUMBER(FIND($I21,$H$21))),1,0)+IF(AND(ISNUMBER(FIND(W$8,$H$22)),ISNUMBER(FIND($I21,$H$22))),1,0)+IF(AND(ISNUMBER(FIND(W$8,$H$23)),ISNUMBER(FIND($I21,$H$23))),1,0)+IF(AND(ISNUMBER(FIND(W$8,$H$24)),ISNUMBER(FIND($I21,$H$24))),1,0)+IF(AND(ISNUMBER(FIND(W$8,$H$25)),ISNUMBER(FIND($I21,$H$25))),1,0)+IF(AND(ISNUMBER(FIND(W$8,$H$26)),ISNUMBER(FIND($I21,$H$26))),1,0)+IF(AND(ISNUMBER(FIND(W$8,$H$27)),ISNUMBER(FIND($I21,$H$27))),1,0)+IF(AND(ISNUMBER(FIND(W$8,$H$28)),ISNUMBER(FIND($I21,$H$28))),1,0)+IF(AND(ISNUMBER(FIND(W$8,$H$29)),ISNUMBER(FIND($I21,$H$29))),1,0)+IF(AND(ISNUMBER(FIND(W$8,$H$30)),ISNUMBER(FIND($I21,$H$30))),1,0)+IF(AND(ISNUMBER(FIND(W$8,$H$31)),ISNUMBER(FIND($I21,$H$31))),1,0)+IF(AND(ISNUMBER(FIND(W$8,$H$32)),ISNUMBER(FIND($I21,$H$32))),1,0)+IF(AND(ISNUMBER(FIND(W$8,$H$33)),ISNUMBER(FIND($I21,$H$33))),1,0)+IF(AND(ISNUMBER(FIND(W$8,$H$34)),ISNUMBER(FIND($I21,$H$34))),1,0)+IF(AND(ISNUMBER(FIND(W$8,$H$35)),ISNUMBER(FIND($I21,$H$35))),1,0)+IF(AND(ISNUMBER(FIND(W$8,$H$36)),ISNUMBER(FIND($I21,$H$36))),1,0)+IF(AND(ISNUMBER(FIND(W$8,$H$37)),ISNUMBER(FIND($I21,$H$37))),1,0)+IF(AND(ISNUMBER(FIND(W$8,$H$38)),ISNUMBER(FIND($I21,$H$38))),1,0)+IF(AND(ISNUMBER(FIND(W$8,$H$39)),ISNUMBER(FIND($I21,$H$39))),1,0)+IF(AND(ISNUMBER(FIND(W$8,$H$40)),ISNUMBER(FIND($I21,$H$40))),1,0)+IF(AND(ISNUMBER(FIND(W$8,$H$41)),ISNUMBER(FIND($I21,$H$41))),1,0)+IF(AND(ISNUMBER(FIND(W$8,$H$42)),ISNUMBER(FIND($I21,$H$42))),1,0)+IF(AND(ISNUMBER(FIND(W$8,$H$43)),ISNUMBER(FIND($I21,$H$43))),1,0)+IF(AND(ISNUMBER(FIND(W$8,$H$44)),ISNUMBER(FIND($I21,$H$44))),1,0)+IF(AND(ISNUMBER(FIND(W$8,$H$45)),ISNUMBER(FIND($I21,$H$45))),1,0)+IF(AND(ISNUMBER(FIND(W$8,$H$46)),ISNUMBER(FIND($I21,$H$46))),1,0)+IF(AND(ISNUMBER(FIND(W$8,$H$47)),ISNUMBER(FIND($I21,$H$47))),1,0)+IF(AND(ISNUMBER(FIND(W$8,$H$48)),ISNUMBER(FIND($I21,$H$48))),1,0)+IF(AND(ISNUMBER(FIND(W$8,$H$49)),ISNUMBER(FIND($I21,$H$49))),1,0)+IF(AND(ISNUMBER(FIND(W$8,$H$50)),ISNUMBER(FIND($I21,$H$50))),1,0)+IF(AND(ISNUMBER(FIND(W$8,$H$51)),ISNUMBER(FIND($I21,$H$51))),1,0)+IF(AND(ISNUMBER(FIND(W$8,$H$52)),ISNUMBER(FIND($I21,$H$52))),1,0)+IF(AND(ISNUMBER(FIND(W$8,$H$53)),ISNUMBER(FIND($I21,$H$53))),1,0)+IF(AND(ISNUMBER(FIND(W$8,$H$54)),ISNUMBER(FIND($I21,$H$54))),1,0)+IF(AND(ISNUMBER(FIND(W$8,$H$55)),ISNUMBER(FIND($I21,$H$55))),1,0)+IF(AND(ISNUMBER(FIND(W$8,$H$56)),ISNUMBER(FIND($I21,$H$56))),1,0)+IF(AND(ISNUMBER(FIND(W$8,$H$57)),ISNUMBER(FIND($I21,$H$57))),1,0)+IF(AND(ISNUMBER(FIND(W$8,$H$58)),ISNUMBER(FIND($I21,$H$58))),1,0)+IF(AND(ISNUMBER(FIND(W$8,$H$59)),ISNUMBER(FIND($I21,$H$59))),1,0)+IF(AND(ISNUMBER(FIND(W$8,$H$60)),ISNUMBER(FIND($I21,$H$60))),1,0)+IF(AND(ISNUMBER(FIND(W$8,$H$61)),ISNUMBER(FIND($I21,$H$61))),1,0)+IF(AND(ISNUMBER(FIND(W$8,$H$62)),ISNUMBER(FIND($I21,$H$62))),1,0)+IF(AND(ISNUMBER(FIND(W$8,$H$63)),ISNUMBER(FIND($I21,$H$63))),1,0)+IF(AND(ISNUMBER(FIND(W$8,$H$64)),ISNUMBER(FIND($I21,$H$64))),1,0)+IF(AND(ISNUMBER(FIND(W$8,$H$65)),ISNUMBER(FIND($I21,$H$65))),1,0)+IF(AND(ISNUMBER(FIND(W$8,$H$66)),ISNUMBER(FIND($I21,$H$66))),1,0)+IF(AND(ISNUMBER(FIND(W$8,$H$67)),ISNUMBER(FIND($I21,$H$67))),1,0)+IF(AND(ISNUMBER(FIND(W$8,$H$68)),ISNUMBER(FIND($I21,$H$68))),1,0)+IF(AND(ISNUMBER(FIND(W$8,$H$69)),ISNUMBER(FIND($I21,$H$69))),1,0)+IF(AND(ISNUMBER(FIND(W$8,$H$70)),ISNUMBER(FIND($I21,$H$70))),1,0)+IF(AND(ISNUMBER(FIND(W$8,$H$71)),ISNUMBER(FIND($I21,$H$71))),1,0)+IF(AND(ISNUMBER(FIND(W$8,$H$72)),ISNUMBER(FIND($I21,$H$72))),1,0)+IF(AND(ISNUMBER(FIND(W$8,$H$73)),ISNUMBER(FIND($I21,$H$73))),1,0)+IF(AND(ISNUMBER(FIND(W$8,$H$74)),ISNUMBER(FIND($I21,$H$74))),1,0)+IF(AND(ISNUMBER(FIND(W$8,$H$75)),ISNUMBER(FIND($I21,$H$75))),1,0)+IF(AND(ISNUMBER(FIND(W$8,$H$76)),ISNUMBER(FIND($I21,$H$76))),1,0)","v":4},5,4,4,5]
["Flight 5",{"$nulls":7},"14",{"$nulls":14},{"$f":"IF(AND(ISNUMBER(FIND(X$8,$H$4)),ISNUMBER(FIND($I22,$H$4))),1,0)+IF(AND(ISNUMBER(FIND(X$8,$H$5)),ISNUMBER(FIND($I22,$H$5))),1,0)+IF(AND(ISNUMBER(FIND(X$8,$H$6)),ISNUMBER(FIND($I22,$H$6))),1,0)+IF(AND(ISNUMBER(FIND(X$8,$H$7)),ISNUMBER(FIND($I22,$H$7))),1,0)+IF(AND(ISNUMBER(FIND(X$8,$H$8)),ISNUMBER(FIND($I22,$H$8))),1,0)+IF(AND(ISNUMBER(FIND(X$8,$H$9)),ISNUMBER(FIND($I22,$H$9))),1,0)+IF(AND(ISNUMBER(FIND(X$8,$H$10)),ISNUMBER(FIND($I22,$H$10))),1,0)+IF(AND(ISNUMBER(FIND(X$8,$H$11)),ISNUMBER(FIND($I22,$H$11))),1,0)+IF(AND(ISNUMBER(FIND(X$8,$H$12)),ISNUMBER(FIND($I22,$H$12))),1,0)+IF(AND(ISNUMBER(FIND(X$8,$H$13)),ISNUMBER(FIND($I22,$H$13))),1,0)+IF(AND(ISNUMBER(FIND(X$8,$H$14)),ISNUMBER(FIND($I22,$H$14))),1,0)+IF(AND(ISNUMBER(FIND(X$8,$H$15)),ISNUMBER(FIND($I22,$H$15))),1,0)+IF(AND(ISNUMBER(FIND(X$8,$H$16)),ISNUMBER(FIND($I22,$H$16))),1,0)+IF(AND(ISNUMBER(FIND(X$8,$H$17)),ISNUMBER(FIND($I22,$H$17))),1,0)+IF(AND(ISNUMBER(FIND(X$8,$H$18)),ISNUMBER(FIND($I22,$H$18))),1,0)+IF(AND(ISNUMBER(FIND(X$8,$H$19)),ISNUMBER(FIND($I22,$H$19))),1,0)+IF(AND(ISNUMBER(FIND(X$8,$H$20)),ISNUMBER(FIND($I22,$H$20))),1,0)+IF(AND(ISNUMBER(FIND(X$8,$H$21)),ISNUMBER(FIND($I22,$H$21))),1,0)+IF(AND(ISNUMBER(FIND(X$8,$H$22)),ISNUMBER(FIND($I22,$H$22))),1,0)+IF(AND(ISNUMBER(FIND(X$8,$H$23)),ISNUMBER(FIND($I22,$H$23))),1,0)+IF(AND(ISNUMBER(FIND(X$8,$H$24)),ISNUMBER(FIND($I22,$H$24))),1,0)+IF(AND(ISNUMBER(FIND(X$8,$H$25)),ISNUMBER(FIND($I22,$H$25))),1,0)+IF(AND(ISNUMBER(FIND(X$8,$H$26)),ISNUMBER(FIND($I22,$H$26))),1,0)+IF(AND(ISNUMBER(FIND(X$8,$H$27)),ISNUMBER(FIND($I22,$H$27))),1,0)+IF(AND(ISNUMBER(FIND(X$8,$H$28)),ISNUMBER(FIND($I22,$H$28))),1,0)+IF(AND(ISNUMBER(FIND(X$8,$H$29)),ISNUMBER(FIND($I22,$H$29))),1,0)+IF(AND(ISNUMBER(FIND(X$8,$H$30)),ISNUMBER(FIND($I22,$H$30))),1,0)+IF(AND(ISNUMBER(FIND(X$8,$H$31)),ISNUMBER(FIND($I22,$H$31))),1,0)+IF(AND(ISNUMBER(FIND(X$8,$H$32)),ISNUMBER(FIND($I22,$H$32))),1,0)+IF(AND(ISNUMBER(FIND(X$8,$H$33)),ISNUMBER(FIND($I22,$H$33))),1,0)+IF(AND(ISNUMBER(FIND(X$8,$H$34)),ISNUMBER(FIND($I22,$H$34))),1,0)+IF(AND(ISNUMBER(FIND(X$8,$H$35)),ISNUMBER(FIND($I22,$H$35))),1,0)+IF(AND(ISNUMBER(FIND(X$8,$H$36)),ISNUMBER(FIND($I22,$H$36))),1,0)+IF(AND(ISNUMBER(FIND(X$8,$H$37)),ISNUMBER(FIND($I22,$H$37))),1,0)+IF(AND(ISNUMBER(FIND(X$8,$H$38)),ISNUMBER(FIND($I22,$H$38))),1,0)+IF(AND(ISNUMBER(FIND(X$8,$H$39)),ISNUMBER(FIND($I22,$H$39))),1,0)+IF(AND(ISNUMBER(FIND(X$8,$H$40)),ISNUMBER(FIND($I22,$H$40))),1,0)+IF(AND(ISNUMBER(FIND(X$8,$H$41)),ISNUMBER(FIND($I22,$H$41))),1,0)+IF(AND(ISNUMBER(FIND(X$8,$H$42)),ISNUMBER(FIND($I22,$H$42))),1,0)+IF(AND(ISNUMBER(FIND(X$8,$H$43)),ISNUMBER(FIND($I22,$H$43))),1,0)+IF(AND(ISNUMBER(FIND(X$8,$H$44)),ISNUMBER(FIND($I22,$H$44))),1,0)+IF(AND(ISNUMBER(FIND(X$8,$H$45)),ISNUMBER(FIND($I22,$H$45))),1,0)+IF(AND(ISNUMBER(FIND(X$8,$H$46)),ISNUMBER(FIND($I22,$H$46))),1,0)+IF(AND(ISNUMBER(FIND(X$8,$H$47)),ISNUMBER(FIND($I22,$H$47))),1,0)+IF(AND(ISNUMBER(FIND(X$8,$H$48)),ISNUMBER(FIND($I22,$H$48))),1,0)+IF(AND(ISNUMBER(FIND(X$8,$H$49)),ISNUMBER(FIND($I22,$H$49))),1,0)+IF(AND(ISNUMBER(FIND(X$8,$H$50)),ISNUMBER(FIND($I22,$H$50))),1,0)+IF(AND(ISNUMBER(FIND(X$8,$H$51)),ISNUMBER(FIND($I22,$H$51))),1,0)+IF(AND(ISNUMBER(FIND(X$8,$H$52)),ISNUMBER(FIND($I22,$H$52))),1,0)+IF(AND(ISNUMBER(FIND(X$8,$H$53)),ISNUMBER(FIND($I22,$H$53))),1,0)+IF(AND(ISNUMBER(FIND(X$8,$H$54)),ISNUMBER(FIND($I22,$H$54))),1,0)+IF(AND(ISNUMBER(FIND(X$8,$H$55)),ISNUMBER(FIND($I22,$H$55))),1,0)+IF(AND(ISNUMBER(FIND(X$8,$H$56)),ISNUMBER(FIND($I22,$H$56))),1,0)+IF(AND(ISNUMBER(FIND(X$8,$H$57)),ISNUMBER(FIND($I22,$H$57))),1,0)+IF(AND(ISNUMBER(FIND(X$8,$H$58)),ISNUMBER(FIND($I22,$H$58))),1,0)+IF(AND(ISNUMBER(FIND(X$8,$H$59)),ISNUMBER(FIND($I22,$H$59))),1,0)+IF(AND(ISNUMBER(FIND(X$8,$H$60)),ISNUMBER(FIND($I22,$H$60))),1,0)+IF(AND(ISNUMBER(FIND(X$8,$H$61)),ISNUMBER(FIND($I22,$H$61))),1,0)+IF(AND(ISNUMBER(FIND(X$8,$H$62)),ISNUMBER(FIND($I22,$H$62))),1,0)+IF(AND(ISNUMBER(FIND(X$8,$H$63)),ISNUMBER(FIND($I22,$H$63))),1,0)+IF(AND(ISNUMBER(FIND(X$8,$H$64)),ISNUMBER(FIND($I22,$H$64))),1,0)+IF(AND(ISNUMBER(FIND(X$8,$H$65)),ISNUMBER(FIND($I22,$H$65))),1,0)+IF(AND(ISNUMBER(FIND(X$8,$H$66)),ISNUMBER(FIND($I22,$H$66))),1,0)+IF(AND(ISNUMBER(FIND(X$8,$H$67)),ISNUMBER(FIND($I22,$H$67))),1,0)+IF(AND(ISNUMBER(FIND(X$8,$H$68)),ISNUMBER(FIND($I22,$H$68))),1,0)+IF(AND(ISNUMBER(FIND(X$8,$H$69)),ISNUMBER(FIND($I22,$H$69))),1,0)+IF(AND(ISNUMBER(FIND(X$8,$H$70)),ISNUMBER(FIND($I22,$H$70))),1,0)+IF(AND(ISNUMBER(FIND(X$8,$H$71)),ISNUMBER(FIND($I22,$H$71))),1,0)+IF(AND(ISNUMBER(FIND(X$8,$H$72)),ISNUMBER(FIND($I22,$H$72))),1,0)+IF(AND(ISNUMBER(FIND(X$8,$H$73)),ISNUMBER(FIND($I22,$H$73))),1,0)+IF(AND(ISNUMBER(FIND(X$8,$H$74)),ISNUMBER(FIND($I22,$H$74))),1,0)+IF(AND(ISNUMBER(FIND(X$8,$H$75)),ISNUMBER(FIND($I22,$H$75))),1,0)+IF(AND(ISNUMBER(FIND(X$8,$H$76)),ISNUMBER(FIND($I22,$H$76))),1,0)","v":4},4,5,5]
[null,1.0,2.0,3.0,4.0,5.0,6.0,null,"15",{"$nulls":15},{"$f":"IF(AND(ISNUMBER(FIND(Y$8,$H$4)),ISNUMBER(FIND($I23,$H$4))),1,0)+IF(AND(ISNUMBER(FIND(Y$8,$H$5)),ISNUMBER(FIND($I23,$H$5))),1,0)+IF(AND(ISNUMBER(FIND(Y$8,$H$6)),ISNUMBER(FIND($I23,$H$6))),1,0)+IF(AND(ISNUMBER(FIND(Y$8,$H$7)),ISNUMBER(FIND($I23,$H$7))),1,0)+IF(AND(ISNUMBER(FIND(Y$8,$H$8)),ISNUMBER(FIND($I23,$H$8))),1,0)+IF(AND(ISNUMBER(FIND(Y$8,$H$9)),ISNUMBER(FIND($I23,$H$9))),1,0)+IF(AND(ISNUMBER(FIND(Y$8,$H$10)),ISNUMBER(FIND($I23,$H$10))),1,0)+IF(AND(ISNUMBER(FIND(Y$8,$H$11)),ISNUMBER(FIND($I23,$H$11))),1,0)+IF(AND(ISNUMBER(FIND(Y$8,$H$12)),ISNUMBER(FIND($I23,$H$12))),1,0)+IF(AND(ISNUMBER(FIND(Y$8,$H$13)),ISNUMBER(FIND($I23,$H$13))),1,0)+IF(AND(ISNUMBER(FIND(Y$8,$H$14)),ISNUMBER(FIND($I23,$H$14))),1,0)+IF(AND(ISNUMBER(FIND(Y$8,$H$15)),ISNUMBER(FIND($I23,$H$15))),1,0)+IF(AND(ISNUMBER(FIND(Y$8,$H$16)),ISNUMBER(FIND($I23,$H$16))),1,0)+IF(AND(ISNUMBER(FIND(Y$8,$H$17)),ISNUMBER(FIND($I23,$H$17))),1,0)+IF(AND(ISNUMBER(FIND(Y$8,$H$18)),ISNUMBER(FIND($I23,$H$18))),1,0)+IF(AND(ISNUMBER(FIND(Y$8,$H$19)),ISNUMBER(FIND($I23,$H$19))),1,0)+IF(AND(ISNUMBER(FIND(Y$8,$H$20)),ISNUMBER(FIND($I23,$H$20))),1,0)+IF(AND(ISNUMBER(FIND(Y$8,$H$21)),ISNUMBER(FIND($I23,$H$21))),1,0)+IF(AND(ISNUMBER(FIND(Y$8,$H$22)),ISNUMBER(FIND($I23,$H$22))),1,0)+IF(AND(ISNUMBER(FIND(Y$8,$H$23)),ISNUMBER(FIND($I23,$H$23))),1,0)+IF(AND(ISNUMBER(FIND(Y$8,$H$24)),ISNUMBER(FIND($I23,$H$24))),1,0)+IF(AND(ISNUMBER(FIND(Y$8,$H$25)),ISNUMBER(FIND($I23,$H$25))),1,0)+IF(AND(ISNUMBER(FIND(Y$8,$H$26)),ISNUMBER(FIND($I23,$H$26))),1,0)+IF(AND(ISNUMBER(FIND(Y$8,$H$27)),ISNUMBER(FIND($I23,$H$27))),1,0)+IF(AND(ISNUMBER(FIND(Y$8,$H$28)),ISNUMBER(FIND($I23,$H$28))),1,0)+IF(AND(ISNUMBER(FIND(Y$8,$H$29)),ISNUMBER(FIND($I23,$H$29))),1,0)+IF(AND(ISNUMBER(FIND(Y$8,$H$30)),ISNUMBER(FIND($I23,$H$30))),1,0)+IF(AND(ISNUMBER(FIND(Y$8,$H$31)),ISNUMBER(FIND($I23,$H$31))),1,0)+IF(AND(ISNUMBER(FIND(Y$8,$H$32)),ISNUMBER(FIND($I23,$H$32))),1,0)+IF(AND(ISNUMBER(FIND(Y$8,$H$33)),ISNUMBER(FIND($I23,$H$33))),1,0)+IF(AND(ISNUMBER(FIND(Y$8,$H$34)),ISNUMBER(FIND($I23,$H$34))),1,0)+IF(AND(ISNUMBER(FIND(Y$8,$H$35)),ISNUMBER(FIND($I23,$H$35))),1,0)+IF(AND(ISNUMBER(FIND(Y$8,$H$36)),ISNUMBER(FIND($I23,$H$36))),1,0)+IF(AND(ISNUMBER(FIND(Y$8,$H$37)),ISNUMBER(FIND($I23,$H$37))),1,0)+IF(AND(ISNUMBER(FIND(Y$8,$H$38)),ISNUMBER(FIND($I23,$H$38))),1,0)+IF(AND(ISNUMBER(FIND(Y$8,$H$39)),ISNUMBER(FIND($I23,$H$39))),1,0)+IF(AND(ISNUMBER(FIND(Y$8,$H$40)),ISNUMBER(FIND($I23,$H$40))),1,0)+IF(AND(ISNUMBER(FIND(Y$8,$H$41)),ISNUMBER(FIND($I23,$H$41))),1,0)+IF(AND(ISNUMBER(FIND(Y$8,$H$42)),ISNUMBER(FIND($I23,$H$42))),1,0)+IF(AND(ISNUMBER(FIND(Y$8,$H$43)),ISNUMBER(FIND($I23,$H$43))),1,0)+IF(AND(ISNUMBER(FIND(Y$8,$H$44)),ISNUMBER(FIND($I23,$H$44))),1,0)+IF(AND(ISNUMBER(FIND(Y$8,$H$45)),ISNUMBER(FIND($I23,$H$45))),1,0)+IF(AND(ISNUMBER(FIND(Y$8,$H$46)),ISNUMBER(FIND($I23,$H$46))),1,0)+IF(AND(ISNUMBER(FIND(Y$8,$H$47)),ISNUMBER(FIND($I23,$H$47))),1,0)+IF(AND(ISNUMBER(FIND(Y$8,$H$48)),ISNUMBER(FIND($I23,$H$48))),1,0)+IF(AND(ISNUMBER(FIND(Y$8,$H$49)),ISNUMBER(FIND($I23,$H$49))),1,0)+IF(AND(ISNUMBER(FIND(Y$8,$H$50)),ISNUMBER(FIND($I23,$H$50))),1,0)+IF(AND(ISNUMBER(FIND(Y$8,$H$51)),ISNUMBER(FIND($I23,$H$51))),1,0)+IF(AND(ISNUMBER(FIND(Y$8,$H$52)),ISNUMBER(FIND($I23,$H$52))),1,0)+IF(AND(ISNUMBER(FIND(Y$8,$H$53)),ISNUMBER(FIND($I23,$H$53))),1,0)+IF(AND(ISNUMBER(FIND(Y$8,$H$54)),ISNUMBER(FIND($I23,$H$54))),1,0)+IF(AND(ISNUMBER(FIND(Y$8,$H$55)),ISNUMBER(FIND($I23,$H$55))),1,0)+IF(AND(ISNUMBER(FIND(Y$8,$H$56)),ISNUMBER(FIND($I23,$H$56))),1,0)+IF(AND(ISNUMBER(FIND(Y$8,$H$57)),ISNUMBER(FIND($I23,$H$57))),1,0)+IF(AND(ISNUMBER(FIND(Y$8,$H$58)),ISNUMBER(FIND($I23,$H$58))),1,0)+IF(AND(ISNUMBER(FIND(Y$8,$H$59)),ISNUMBER(FIND($I23,$H$59))),1,0)+IF(AND(ISNUMBER(FIND(Y$8,$H$60)),ISNUMBER(FIND($I23,$H$60))),1,0)+IF(AND(ISNUMBER(FIND(Y$8,$H$61)),ISNUMBER(FIND($I23,$H$61))),1,0)+IF(AND(ISNUMBER(FIND(Y$8,$H$62)),ISNUMBER(FIND($I23,$H$62))),1,0)+IF(AND(ISNUMBER(FIND(Y$8,$H$63)),ISNUMBER(FIND($I23,$H$63))),1,0)+IF(AND(ISNUMBER(FIND(Y$8,$H$64)),ISNUMBER(FIND($I23,$H$64))),1,0)+IF(AND(ISNUMBER(FIND(Y$8,$H$65)),ISNUMBER(FIND($I23,$H$65))),1,0)+IF(AND(ISNUMBER(FIND(Y$8,$H$66)),ISNUMBER(FIND($I23,$H$66))),1,0)+IF(AND(ISNUMBER(FIND(Y$8,$H$67)),ISNUMBER(FIND($I23,$H$67))),1,0)+IF(AND(ISNUMBER(FIND(Y$8,$H$68)),ISNUMBER(FIND($I23,$H$68))),1,0)+IF(AND(ISNUMBER(FIND(Y$8,$H$69)),ISNUMBER(FIND($I23,$H$69))),1,0)+IF(AND(ISNUMBER(FIND(Y$8,$H$70)),ISNUMBER(FIND($I23,$H$70))),1,0)+IF(AND(ISNUMBER(FIND(Y$8,$H$71)),ISNUMBER(FIND($I23,$H$71))),1,0)+IF(AND(ISNUMBER(FIND(Y$8,$H$72)),ISNUMBER(FIND($I23,$H$72))),1,0)+IF(AND(ISNUMBER(FIND(Y$8,$H$73)),ISNUMBER(FIND($I23,$H$73))),1,0)+IF(AND(ISNUMBER(FIND(Y$8,$H$74)),ISNUMBER(FIND($I23,$H$74))),1,0)+IF(AND(ISNUMBER(FIND(Y$8,$H$75)),ISNUMBER(FIND($I23,$H$75))),1,0)+IF(AND(ISNUMBER(FIND(Y$8,$H$76)),ISNUMBER(FIND($I23,$H$76))),1,0)","v":4},6,4]
["R13",{"$f":"VLOOKUP(VALUE(MID($A24,2,2)),Bron!$A$2:$G$46,B$3+1,FALSE)","v":9},{"$f":"VLOOKUP(VALUE(MID($A24,2,2)),Bron!$A$2:$G$46,C$3+1,FALSE)","v":10},{"$f":"VLOOKUP(VALUE(MID($A24,2,2)),Bron!$A$2:$G$46,D$3+1,FALSE)","v":3},{"$f":"VLOOKUP(VALUE(MID($A24,2,2)),Bron!$A$2:$G$46,E$3+1,FALSE)","v":18},{"$f":"VLOOKUP(VALUE(MID($A24,2,2)),Bron!$A$2:$G$46,F$3+1,FALSE)","v":14},{"$f":"VLOOKUP(VALUE(MID($A24,2,2)),Bron!$A$2:$G$46,G$3+1,FALSE)","v":11},{"$f":"TEXT(B24,\"00\")&\";\"&TEXT(C24,\"00\")&\";\"&TEXT(D24,\"00\")&\";\"&TEXT(E24,\"00\")&\";\"&TEXT(F24,\"00\")&\";\"&TEXT(G24,\"00\")","v":"09;10;03;18;14;11"},"16",{"$nulls":16},{"$f":"IF(AND(ISNUMBER(FIND(Z$8,$H$4)),ISNUMBER(FIND($I24,$H$4))),1,0)+IF(AND(ISNUMBER(FIND(Z$8,$H$5)),ISNUMBER(FIND($I24,$H$5))),1,0)+IF(AND(ISNUMBER(FIND(Z$8,$H$6)),ISNUMBER(FIND($I24,$H$6))),1,0)+IF(AND(ISNUMBER(FIND(Z$8,$H$7)),ISNUMBER(FIND($I24,$H$7))),1,0)+IF(AND(ISNUMBER(FIND(Z$8,$H$8)),ISNUMBER(FIND($I24,$H$8))),1,0)+IF(AND(ISNUMBER(FIND(Z$8,$H$9)),ISNUMBER(FIND($I24,$H$9))),1,0)+IF(AND(ISNUMBER(FIND(Z$8,$H$10)),ISNUMBER(FIND($I24,$H$10))),1,0)+IF(AND(ISNUMBER(FIND(Z$8,$H$11)),ISNUMBER(FIND($I24,$H$11))),1,0)+IF(AND(ISNUMBER(FIND(Z$8,$H$12)),ISNUMBER(FIND($I24,$H$12))),1,0)+IF(AND(ISNUMBER(FIND(Z$8,$H$13)),ISNUMBER(FIND($I24,$H$13))),1,0)+IF(AND(ISNUMBER(FIND(Z$8,$H$14)),ISNUMBER(FIND($I24,$H$14))),1,0)+IF(AND(ISNUMBER(FIND(Z$8,$H$15)),ISNUMBER(FIND($I24,$H$15))),1,0)+IF(AND(ISNUMBER(FIND(Z$8,$H$16)),ISNUMBER(FIND($I24,$H$16))),1,0)+IF(AND(ISNUMBER(FIND(Z$8,$H$17)),ISNUMBER(FIND($I24,$H$17))),1,0)+IF(AND(ISNUMBER(FIND(Z$8,$H$18)),ISNUMBER(FIND($I24,$H$18))),1,0)+IF(AND(ISNUMBER(FIND(Z$8,$H$19)),ISNUMBER(FIND($I24,$H$19))),1,0)+IF(AND(ISNUMBER(FIND(Z$8,$H$20)),ISNUMBER(FIND($I24,$H$20))),1,0)+IF(AND(ISNUMBER(FIND(Z$8,$H$21)),ISNUMBER(FIND($I24,$H$21))),1,0)+IF(AND(ISNUMBER(FIND(Z$8,$H$22)),ISNUMBER(FIND($I24,$H$22))),1,0)+IF(AND(ISNUMBER(FIND(Z$8,$H$23)),ISNUMBER(FIND($I24,$H$23))),1,0)+IF(AND(ISNUMBER(FIND(Z$8,$H$24)),ISNUMBER(FIND($I24,$H$24))),1,0)+IF(AND(ISNUMBER(FIND(Z$8,$H$25)),ISNUMBER(FIND($I24,$H$25))),1,0)+IF(AND(ISNUMBER(FIND(Z$8,$H$26)),ISNUMBER(FIND($I24,$H$26))),1,0)+IF(AND(ISNUMBER(FIND(Z$8,$H$27)),ISNUMBER(FIND($I24,$H$27))),1,0)+IF(AND(ISNUMBER(FIND(Z$8,$H$28)),ISNUMBER(FIND($I24,$H$28))),1,0)+IF(AND(ISNUMBER(FIND(Z$8,$H$29)),ISNUMBER(FIND($I24,$H$29))),1,0)+IF(AND(ISNUMBER(FIND(Z$8,$H$30)),ISNUMBER(FIND($I24,$H$30))),1,0)+IF(AND(ISNUMBER(FIND(Z$8,$H$31)),ISNUMBER(FIND($I24,$H$31))),1,0)+IF(AND(ISNUMBER(FIND(Z$8,$H$32)),ISNUMBER(FIND($I24,$H$32))),1,0)+IF(AND(ISNUMBER(FIND(Z$8,$H$33)),ISNUMBER(FIND($I24,$H$33))),1,0)+IF(AND(ISNUMBER(FIND(Z$8,$H$34)),ISNUMBER(FIND($I24,$H$34))),1,0)+IF(AND(ISNUMBER(FIND(Z$8,$H$35)),ISNUMBER(FIND($I24,$H$35))),1,0)+IF(AND(ISNUMBER(FIND(Z$8,$H$36)),ISNUMBER(FIND($I24,$H$36))),1,0)+IF(AND(ISNUMBER(FIND(Z$8,$H$37)),ISNUMBER(FIND($I24,$H$37))),1,0)+IF(AND(ISNUMBER(FIND(Z$8,$H$38)),ISNUMBER(FIND($I24,$H$38))),1,0)+IF(AND(ISNUMBER(FIND(Z$8,$H$39)),ISNUMBER(FIND($I24,$H$39))),1,0)+IF(AND(ISNUMBER(FIND(Z$8,$H$40)),ISNUMBER(FIND($I24,$H$40))),1,0)+IF(AND(ISNUMBER(FIND(Z$8,$H$41)),ISNUMBER(FIND($I24,$H$41))),1,0)+IF(AND(ISNUMBER(FIND(Z$8,$H$42)),ISNUMBER(FIND($I24,$H$42))),1,0)+IF(AND(ISNUMBER(FIND(Z$8,$H$43)),ISNUMBER(FIND($I24,$H$43))),1,0)+IF(AND(ISNUMBER(FIND(Z$8,$H$44)),ISNUMBER(FIND($I24,$H$44))),1,0)+IF(AND(ISNUMBER(FIND(Z$8,$H$45)),ISNUMBER(FIND($I24,$H$45))),1,0)+IF(AND(ISNUMBER(FIND(Z$8,$H$46)),ISNUMBER(FIND($I24,$H$46))),1,0)+IF(AND(ISNUMBER(FIND(Z$8,$H$47)),ISNUMBER(FIND($I24,$H$47))),1,0)+IF(AND(ISNUMBER(FIND(Z$8,$H$48)),ISNUMBER(FIND($I24,$H$48))),1,0)+IF(AND(ISNUMBER(FIND(Z$8,$H$49)),ISNUMBER(FIND($I24,$H$49))),1,0)+IF(AND(ISNUMBER(FIND(Z$8,$H$50)),ISNUMBER(FIND($I24,$H$50))),1,0)+IF(AND(ISNUMBER(FIND(Z$8,$H$51)),ISNUMBER(FIND($I24,$H$51))),1,0)+IF(AND(ISNUMBER(FIND(Z$8,$H$52)),ISNUMBER(FIND($I24,$H$52))),1,0)+IF(AND(ISNUMBER(FIND(Z$8,$H$53)),ISNUMBER(FIND($I24,$H$53))),1,0)+IF(AND(ISNUMBER(FIND(Z$8,$H$54)),ISNUMBER(FIND($I24,$H$54))),1,0)+IF(AND(ISNUMBER(FIND(Z$8,$H$55)),ISNUMBER(FIND($I24,$H$55))),1,0)+IF(AND(ISNUMBER(FIND(Z$8,$H$56)),ISNUMBER(FIND($I24,$H$56))),1,0)+IF(AND(ISNUMBER(FIND(Z$8,$H$57)),ISNUMBER(FIND($I24,$H$57))),1,0)+IF(AND(ISNUMBER(FIND(Z$8,$H$58)),ISNUMBER(FIND($I24,$H$58))),1,0)+IF(AND(ISNUMBER(FIND(Z$8,$H$59)),ISNUMBER(FIND($I24,$H$59))),1,0)+IF(AND(ISNUMBER(FIND(Z$8,$H$60)),ISNUMBER(FIND($I24,$H$60))),1,0)+IF(AND(ISNUMBER(FIND(Z$8,$H$61)),ISNUMBER(FIND($I24,$H$61))),1,0)+IF(AND(ISNUMBER(FIND(Z$8,$H$62)),ISNUMBER(FIND($I24,$H$62))),1,0)+IF(AND(ISNUMBER(FIND(Z$8,$H$63)),ISNUMBER(FIND($I24,$H$63))),1,0)+IF(AND(ISNUMBER(FIND(Z$8,$H$64)),ISNUMBER(FIND($I24,$H$64))),1,0)+IF(AND(ISNUMBER(FIND(Z$8,$H$65)),ISNUMBER(FIND($I24,$H$65))),1,0)+IF(AND(ISNUMBER(FIND(Z$8,$H$66)),ISNUMBER(FIND($I24,$H$66))),1,0)+IF(AND(ISNUMBER(FIND(Z$8,$H$67)),ISNUMBER(FIND($I24,$H$67))),1,0)+IF(AND(ISNUMBER(FIND(Z$8,$H$68)),ISNUMBER(FIND($I24,$H$68))),1,0)+IF(AND(ISNUMBER(FIND(Z$8,$H$69)),ISNUMBER(FIND($I24,$H$69))),1,0)+IF(AND(ISNUMBER(FIND(Z$8,$H$70)),ISNUMBER(FIND($I24,$H$70))),1,0)+IF(AND(ISNUMBER(FIND(Z$8,$H$71)),ISNUMBER(FIND($I24,$H$71))),1,0)+IF(AND(ISNUMBER(FIND(Z$8,$H$72)),ISNUMBER(FIND($I24,$H$72))),1,0)+IF(AND(ISNUMBER(FIND(Z$8,$H$73)),ISNUMBER(FIND($I24,$H$73))),1,0)+IF(AND(ISNUMBER(FIND(Z$8,$H$74)),ISNUMBER(FIND($I24,$H$74))),1,0)+IF(AND(ISNUMBER(FIND(Z$8,$H$75)),ISNUMBER(FIND($I24,$H$75))),1,0)+IF(AND(ISNUMBER(FIND(Z$8,$H$76)),ISNUMBER(FIND($I24,$H$76))),1,0)","v":6},4]
["R14",{"$f":"VLOOKUP(VALUE(MID($A25,2,2)),Bron!$A$2:$G$46,B$3+1,FALSE)","v":8},{"$f":"VLOOKUP(VALUE(MID($A25,2,2)),Bron!$A$2:$G$46,C$3+1,FALSE)","v":4},{"$f":"VLOOKUP(VALUE(MID($A25,2,2)),Bron!$A$2:$G$46,D$3+1,FALSE)","v":7},{"$f":"VLOOKUP(VALUE(MID($A25,2,2)),Bron!$A$2:$G$46,E$3+1,FALSE)","v":13},{"$f":"VLOOKUP(VALUE(MID($A25,2,2)),Bron!$A$2:$G$46,F$3+1,FALSE)","v":6},{"$f":"VLOOKUP(VALUE(MID($A25,2,2)),Bron!$A$2:$G$46,G$3+1,FALSE)","v":1},"08;04;07;13;06;01","17",{"$nulls":17},{"$f":"IF(AND(ISNUMBER(FIND(AA$8,$H$4)),ISNUMBER(FIND($I25,$H$4))),1,0)+IF(AND(ISNUMBER(FIND(AA$8,$H$5)),ISNUMBER(FIND($I25,$H$5))),1,0)+IF(AND(ISNUMBER(FIND(AA$8,$H$6)),ISNUMBER(FIND($I25,$H$6))),1,0)+IF(AND(ISNUMBER(FIND(AA$8,$H$7)),ISNUMBER(FIND($I25,$H$7))),1,0)+IF(AND(ISNUMBER(FIND(AA$8,$H$8)),ISNUMBER(FIND($I25,$H$8))),1,0)+IF(AND(ISNUMBER(FIND(AA$8,$H$9)),ISNUMBER(FIND($I25,$H$9))),1,0)+IF(AND(ISNUMBER(FIND(AA$8,$H$10)),ISNUMBER(FIND($I25,$H$10))),1,0)+IF(AND(ISNUMBER(FIND(AA$8,$H$11)),ISNUMBER(FIND($I25,$H$11))),1,0)+IF(AND(ISNUMBER(FIND(AA$8,$H$12)),ISNUMBER(FIND($I25,$H$12))),1,0)+IF(AND(ISNUMBER(FIND(AA$8,$H$13)),ISNUMBER(FIND($I25,$H$13))),1,0)+IF(AND(ISNUMBER(FIND(AA$8,$H$14)),ISNUMBER(FIND($I25,$H$14))),1,0)+IF(AND(ISNUMBER(FIND(AA$8,$H$15)),ISNUMBER(FIND($I25,$H$15))),1,0)+IF(AND(ISNUMBER(FIND(AA$8,$H$16)),ISNUMBER(FIND($I25,$H$16))),1,0)+IF(AND(ISNUMBER(FIND(AA$8,$H$17)),ISNUMBER(FIND($I25,$H$17))),1,0)+IF(AND(ISNUMBER(FIND(AA$8,$H$18)),ISNUMBER(FIND($I25,$H$18))),1,0)+IF(AND(ISNUMBER(FIND(AA$8,$H$19)),ISNUMBER(FIND($I25,$H$19))),1,0)+IF(AND(ISNUMBER(FIND(AA$8,$H$20)),ISNUMBER(FIND($I25,$H$20))),1,0)+IF(AND(ISNUMBER(FIND(AA$8,$H$21)),ISNUMBER(FIND($I25,$H$21))),1,0)+IF(AND(ISNUMBER(FIND(AA$8,$H$22)),ISNUMBER(FIND($I25,$H$22))),1,0)+IF(AND(ISNUMBER(FIND(AA$8,$H$23)),ISNUMBER(FIND($I25,$H$23))),1,0)+IF(AND(ISNUMBER(FIND(AA$8,$H$24)),ISNUMBER(FIND($I25,$H$24))),1,0)+IF(AND(ISNUMBER(FIND(AA$8,$H$25)),ISNUMBER(FIND($I25,$H$25))),1,0)+IF(AND(ISNUMBER(FIND(AA$8,$H$26)),ISNUMBER(FIND($I25,$H$26))),1,0)+IF(AND(ISNUMBER(FIND(AA$8,$H$27)),ISNUMBER(FIND($I25,$H$27))),1,0)+IF(AND(ISNUMBER(FIND(AA$8,$H$28)),ISNUMBER(FIND($I25,$H$28))),1,0)+IF(AND(ISNUMBER(FIND(AA$8,$H$29)),ISNUMBER(FIND($I25,$H$29))),1,0)+IF(AND(ISNUMBER(FIND(AA$8,$H$30)),ISNUMBER(FIND($I25,$H$30))),1,0)+IF(AND(ISNUMBER(FIND(AA$8,$H$31)),ISNUMBER(FIND($I25,$H$31))),1,0)+IF(AND(ISNUMBER(FIND(AA$8,$H$32)),ISNUMBER(FIND($I25,$H$32))),1,0)+IF(AND(ISNUMBER(FIND(AA$8,$H$33)),ISNUMBER(FIND($I25,$H$33))),1,0)+IF(AND(ISNUMBER(FIND(AA$8,$H$34)),ISNUMBER(FIND($I25,$H$34))),1,0)+IF(AND(ISNUMBER(FIND(AA$8,$H$35)),ISNUMBER(FIND($I25,$H$35))),1,0)+IF(AND(ISNUMBER(FIND(AA$8,$H$36)),ISNUMBER(FIND($I25,$H$36))),1,0)+IF(AND(ISNUMBER(FIND(AA$8,$H$37)),ISNUMBER(FIND($I25,$H$37))),1,0)+IF(AND(ISNUMBER(FIND(AA$8,$H$38)),ISNUMBER(FIND($I25,$H$38))),1,0)+IF(AND(ISNUMBER(FIND(AA$8,$H$39)),ISNUMBER(FIND($I25,$H$39))),1,0)+IF(AND(ISNUMBER(FIND(AA$8,$H$40)),ISNUMBER(FIND($I25,$H$40))),1,0)+IF(AND(ISNUMBER(FIND(AA$8,$H$41)),ISNUMBER(FIND($I25,$H$41))),1,0)+IF(AND(ISNUMBER(FIND(AA$8,$H$42)),ISNUMBER(FIND($I25,$H$42))),1,0)+IF(AND(ISNUMBER(FIND(AA$8,$H$43)),ISNUMBER(FIND($I25,$H$43))),1,0)+IF(AND(ISNUMBER(FIND(AA$8,$H$44)),ISNUMBER(FIND($I25,$H$44))),1,0)+IF(AND(ISNUMBER(FIND(AA$8,$H$45)),ISNUMBER(FIND($I25,$H$45))),1,0)+IF(AND(ISNUMBER(FIND(AA$8,$H$46)),ISNUMBER(FIND($I25,$H$46))),1,0)+IF(AND(ISNUMBER(FIND(AA$8,$H$47)),ISNUMBER(FIND($I25,$H$47))),1,0)+IF(AND(ISNUMBER(FIND(AA$8,$H$48)),ISNUMBER(FIND($I25,$H$48))),1,0)+IF(AND(ISNUMBER(FIND(AA$8,$H$49)),ISNUMBER(FIND($I25,$H$49))),1,0)+IF(AND(ISNUMBER(FIND(AA$8,$H$50)),ISNUMBER(FIND($I25,$H$50))),1,0)+IF(AND(ISNUMBER(FIND(AA$8,$H$51)),ISNUMBER(FIND($I25,$H$51))),1,0)+IF(AND(ISNUMBER(FIND(AA$8,$H$52)),ISNUMBER(FIND($I25,$H$52))),1,0)+IF(AND(ISNUMBER(FIND(AA$8,$H$53)),ISNUMBER(FIND($I25,$H$53))),1,0)+IF(AND(ISNUMBER(FIND(AA$8,$H$54)),ISNUMBER(FIND($I25,$H$54))),1,0)+IF(AND(ISNUMBER(FIND(AA$8,$H$55)),ISNUMBER(FIND($I25,$H$55))),1,0)+IF(AND(ISNUMBER(FIND(AA$8,$H$56)),ISNUMBER(FIND($I25,$H$56))),1,0)+IF(AND(ISNUMBER(FIND(AA$8,$H$57)),ISNUMBER(FIND($I25,$H$57))),1,0)+IF(AND(ISNUMBER(FIND(AA$8,$H$58)),ISNUMBER(FIND($I25,$H$58))),1,0)+IF(AND(ISNUMBER(FIND(AA$8,$H$59)),ISNUMBER(FIND($I25,$H$59))),1,0)+IF(AND(ISNUMBER(FIND(AA$8,$H$60)),ISNUMBER(FIND($I25,$H$60))),1,0)+IF(AND(ISNUMBER(FIND(AA$8,$H$61)),ISNUMBER(FIND($I25,$H$61))),1,0)+IF(AND(ISNUMBER(FIND(AA$8,$H$62)),ISNUMBER(FIND($I25,$H$62))),1,0)+IF(AND(ISNUMBER(FIND(AA$8,$H$63)),ISNUMBER(FIND($I25,$H$63))),1,0)+IF(AND(ISNUMBER(FIND(AA$8,$H$64)),ISNUMBER(FIND($I25,$H$64))),1,0)+IF(AND(ISNUMBER(FIND(AA$8,$H$65)),ISNUMBER(FIND($I25,$H$65))),1,0)+IF(AND(ISNUMBER(FIND(AA$8,$H$66)),ISNUMBER(FIND($I25,$H$66))),1,0)+IF(AND(ISNUMBER(FIND(AA$8,$H$67)),ISNUMBER(FIND($I25,$H$67))),1,0)+IF(AND(ISNUMBER(FIND(AA$8,$H$68)),ISNUMBER(FIND($I25,$H$68))),1,0)+IF(AND(ISNUMBER(FIND(AA$8,$H$69)),ISNUMBER(FIND($I25,$H$69))),1,0)+IF(AND(ISNUMBER(FIND(AA$8,$H$70)),ISNUMBER(FIND($I25,$H$70))),1,0)+IF(AND(ISNUMBER(FIND(AA$8,$H$71)),ISNUMBER(FIND($I25,$H$71))),1,0)+IF(AND(ISNUMBER(FIND(AA$8,$H$72)),ISNUMBER(FIND($I25,$H$72))),1,0)+IF(AND(ISNUMBER(FIND(AA$8,$H$73)),ISNUMBER(FIND($I25,$H$73))),1,0)+IF(AND(ISNUMBER(FIND(AA$8,$H$74)),ISNUMBER(FIND($I25,$H$74))),1,0)+IF(AND(ISNUMBER(FIND(AA$8,$H$75)),ISNUMBER(FIND($I25,$H$75))),1,0)+IF(AND(ISNUMBER(FIND(AA$8,$H$76)),ISNUMBER(FIND($I25,$H$76))),1,0)","v":3}]
["R15",{"$f":"VLOOKUP(VALUE(MID($A26,2,2)),Bron!$A$2:$G$46,B$3+1,FALSE)","v":15},{"$f":"VLOOKUP(VALUE(MID($A26,2,2)),Bron!$A$2:$G$46,C$3+1,FALSE)","v":16},{"$f":"VLOOKUP(VALUE(MID($A26,2,2)),Bron!$A$2:$G$46,D$3+1,FALSE)","v":2},{"$f":"VLOOKUP(VALUE(MID($A26,2,2)),Bron!$A$2:$G$46,E$3+1,FALSE)","v":17},{"$f":"VLOOKUP(VALUE(MID($A26,2,2)),Bron!$A$2:$G$46,F$3+1,FALSE)","v":5},{"$f":"VLOOKUP(VALUE(MID($A26,2,2)),Bron!$A$2:$G$46,G$3+1,FALSE)","v":12},"15;16;02;17;05;12","18"]
["Flight 6"]
[null,1.0,2.0,3.0,4.0,5.0,6.0]
["R16",{"$f":"VLOOKUP(VALUE(MID($A29,2,2)),Bron!$A$2:$G$46,B$3+1,FALSE)","v":10},{"$f":"VLOOKUP(VALUE(MID($A29,2,2)),Bron!$A$2:$G$46,C$3+1,FALSE)","v":4},{"$f":"VLOOKUP(VALUE(MID($A29,2,2)),Bron!$A$2:$G$46,D$3+1,FALSE)","v":3},{"$f":"VLOOKUP(VALUE(MID($A29,2,2)),Bron!$A$2:$G$46,E$3+1,FALSE)","v":7},{"$f":"VLOOKUP(VALUE(MID($A29,2,2)),Bron!$A$2:$G$46,F$3+1,FALSE)","v":5},{"$f":"VLOOKUP(VALUE(MID($A29,2,2)),Bron!$A$2:$G$46,G$3+1,FALSE)","v":12},{"$f":"TEXT(B29,\"00\")&\";\"&TEXT(C29,\"00\")&\";\"&TEXT(D29,\"00\")&\";\"&TEXT(E29,\"00\")&\";\"&TEXT(F29,\"00\")&\";\"&TEXT(G29,\"00\")","v":"10;04;03;07;05;12"}]
["R17",{"$f":"VLOOKUP(VALUE(MID($A30,2,2)),Bron!$A$2:$G$46,B$3+1,FALSE)","v":6},{"$f":"VLOOKUP(VALUE(MID($A30,2,2)),Bron!$A$2:$G$46,C$3+1,FALSE)","v":11},{"$f":"VLOOKUP(VALUE(MID($A30,2,2)),Bron!$A$2:$G$46,D$3+1,FALSE)","v":8},{"$f":"VLOOKUP(VALUE(MID($A30,2,2)),Bron!$A$2:$G$46,E$3+1,FALSE)","v":2},{"$f":"VLOOKUP(VALUE(MID($A30,2,2)),Bron!$A$2:$G$46,F$3+1,FALSE)","v":16},{"$f":"VLOOKUP(VALUE(MID($A30,2,2)),Bron!$A$2:$G$46,G$3+1,FALSE)","v":9},"06;11;08;02;16;09"]
["R18",{"$f":"VLOOKUP(VALUE(MID($A31,2,2)),Bron!$A$2:$G$46,B$3+1,FALSE)","v":17},{"$f":"VLOOKUP(VALUE(MID($A31,2,2)),Bron!$A$2:$G$46,C$3+1,FALSE)","v":15},{"$f":"VLOOKUP(VALUE(MID($A31,2,2)),Bron!$A$2:$G$46,D$3+1,FALSE)","v":14},{"$f":"VLOOKUP(VALUE(MID($A31,2,2)),Bron!$A$2:$G$46,E$3+1,FALSE)","v":1},{"$f":"VLOOKUP(VALUE(MID($A31,2,2)),Bron!$A$2:$G$46,F$3+1,FALSE)","v":18},{"$f":"VLOOKUP(VALUE(MID($A31,2,2)),Bron!$A$2:$G$46,G$3+1,FALSE)","v":13},"17;15;14;01;18;13"]
["Flight 7"]
[null,1.0,2.0,3.0,4.0,5.0,6.0]
["R19",{"$f":"VLOOKUP(VALUE(MID($A34,2,2)),Bron!$A$2:$G$46,B$3+1,FALSE)","v":16},{"$f":"VLOOKUP(VALUE(MID($A34,2,2)),Bron!$A$2:$G$46,C$3+1,FALSE)","v":15},{"$f":"VLOOKUP(VALUE(MID($A34,2,2)),Bron!$A$2:$G$46,D$3+1,FALSE)","v":6},{"$f":"VLOOKUP(VALUE(MID($A34,2,2)),Bron!$A$2:$G$46,E$3+1,FALSE)","v":1},{"$f":"VLOOKUP(VALUE(MID($A34,2,2)),Bron!$A$2:$G$46,F$3+1,FALSE)","v":3},{"$f":"VLOOKUP(VALUE(MID($A34,2,2)),Bron!$A$2:$G$46,G$3+1,FALSE)","v":4},{"$f":"TEXT(B34,\"00\")&\";\"&TEXT(C34,\"00\")&\";\"&TEXT(D34,\"00\")&\";\"&TEXT(E34,\"00\")&\";\"&TEXT(F34,\"00\")&\";\"&TEXT(G34,\"00\")","v":"16;15;06;01;03;04"}]
["R20",{"$f":"VLOOKUP(VALUE(MID($A35,2,2)),Bron!$A$2:$G$46,B$3+1,FALSE)","v":5},{"$f":"VLOOKUP(VALUE(MID($A35,2,2)),Bron!$A$2:$G$46,C$3+1,FALSE)","v":17},{"$f":"VLOOKUP(VALUE(MID($A35,2,2)),Bron!$A$2:$G$46,D$3+1,FALSE)","v":13},{"$f":"VLOOKUP(VALUE(MID($A35,2,2)),Bron!$A$2:$G$46,E$3+1,FALSE)","v":11},{"$f":"VLOOKUP(VALUE(MID($A35,2,2)),Bron!$A$2:$G$46,F$3+1,FALSE)","v":10},{"$f":"VLOOKUP(VALUE(MID($A35,2,2)),Bron!$A$2:$G$46,G$3+1,FALSE)","v":7},"05;17;13;11;10;07"]
["R21",{"$f":"VLOOKUP(VALUE(MID($A36,2,2)),Bron!$A$2:$G$46,B$3+1,FALSE)","v":12},{"$f":"VLOOKUP(VALUE(MID($A36,2,2)),Bron!$A$2:$G$46,C$3+1,FALSE)","v":18},{"$f":"VLOOKUP(VALUE(MID($A36,2,2)),Bron!$A$2:$G$46,D$3+1,FALSE)","v":9},{"$f":"VLOOKUP(VALUE(MID($A36,2,2)),Bron!$A$2:$G$46,E$3+1,FALSE)","v":2},{"$f":"VLOOKUP(VALUE(MID($A36,2,2)),Bron!$A$2:$G$46,F$3+1,FALSE)","v":8},{"$f":"VLOOKUP(VALUE(MID($A36,2,2)),Bron!$A$2:$G$46,G$3+1,FALSE)","v":14},"12;18;09;02;08;14"]
["Flight 8"]
[null,1.0,2.0,3.0,4.0,5.0,6.0]
["R22",{"$f":"VLOOKUP(VALUE(MID($A39,2,2)),Bron!$A$2:$G$46,B$3+1,FALSE)","v":3},{"$f":"VLOOKUP(VALUE(MID($A39,2,2)),Bron!$A$2:$G$46,C$3+1,FALSE)","v":18},{"$f":"VLOOKUP(VALUE(MID($A39,2,2)),Bron!$A$2:$G$46,D$3+1,FALSE)","v":9},{"$f":"VLOOKUP(VALUE(MID($A39,2,2)),Bron!$A$2:$G$46,E$3+1,FALSE)","v":6},{"$f":"VLOOKUP(VALUE(MID($A39,2,2)),Bron!$A$2:$G$46,F$3+1,FALSE)","v":12},{"$f":"VLOOKUP(VALUE(MID($A39,2,2)),Bron!$A$2:$G$46,G$3+1,FALSE)","v":4},{"$f":"TEXT(B39,\"00\")&\";\"&TEXT(C39,\"00\")&\";\"&TEXT(D39,\"00\")&\";\"&TEXT(E39,\"00\")&\";\"&TEXT(F39,\"00\")&\";\"&TEXT(G39,\"00\")","v":"03;18;09;06;12;04"}]
["R23",{"$f":"VLOOKUP(VALUE(MID($A40,2,2)),Bron!$A$2:$G$46,B$3+1,FALSE)","v":13},{"$f":"VLOOKUP(VALUE(MID($A40,2,2)),Bron!$A$2:$G$46,C$3+1,FALSE)","v":1},{"$f":"VLOOKUP(VALUE(MID($A40,2,2)),Bron!$A$2:$G$46,D$3+1,FALSE)","v":8},{"$f":"VLOOKUP(VALUE(MID($A40,2,2)),Bron!$A$2:$G$46,E$3+1,FALSE)","v":14},{"$f":"VLOOKUP(VALUE(MID($A40,2,2)),Bron!$A$2:$G$46,F$3+1,FALSE)","v":2},{"$f":"VLOOKUP(VALUE(MID($A40,2,2)),Bron!$A$2:$G$46,G$3+1,FALSE)","v":5},"13;01;08;14;02;05"]
["R24",{"$f":"VLOOKUP(VALUE(MID($A41,2,2)),Bron!$A$2:$G$46,B$3+1,FALSE)","v":16},{"$f":"VLOOKUP(VALUE(MID($A41,2,2)),Bron!$A$2:$G$46,C$3+1,FALSE)","v":17},{"$f":"VLOOKUP(VALUE(MID($A41,2,2)),Bron!$A$2:$G$46,D$3+1,FALSE)","v":15},{"$f":"VLOOKUP(VALUE(MID($A41,2,2)),Bron!$A$2:$G$46,E$3+1,FALSE)","v":10},{"$f":"VLOOKUP(VALUE(MID($A41,2,2)),Bron!$A$2:$G$46,F$3+1,FALSE)","v":7},{"$f":"VLOOKUP(VALUE(MID($A41,2,2)),Bron!$A$2:$G$46,G$3+1,FALSE)","v":11},"16;17;15;10;07;11"]
["Flight 9"]
[null,1.0,2.0,3.0,4.0,5.0,6.0]
["R25",{"$f":"VLOOKUP(VALUE(MID($A44,2,2)),Bron!$A$2:$G$46,B$3+1,FALSE)","v":14},{"$f":"VLOOKUP(VALUE(MID($A44,2,2)),Bron!$A$2:$G$46,C$3+1,FALSE)","v":8},{"$f":"VLOOKUP(VALUE(MID($A44,2,2)),Bron!$A$2:$G$46,D$3+1,FALSE)","v":3},{"$f":"VLOOKUP(VALUE(MID($A44,2,2)),Bron!$A$2:$G$46,E$3+1,FALSE)","v":10},{"$f":"VLOOKUP(VALUE(MID($A44,2,2)),Bron!$A$2:$G$46,F$3+1,FALSE)","v":1},{"$f":"VLOOKUP(VALUE(MID($A44,2,2)),Bron!$A$2:$G$46,G$3+1,FALSE)","v":2},{"$f":"TEXT(B44,\"00\")&\";\"&TEXT(C44,\"00\")&\";\"&TEXT(D44,\"00\")&\";\"&TEXT(E44,\"00\")&\";\"&TEXT(F44,\"00\")&\";\"&TEXT(G44,\"00\")","v":"14;08;03;10;01;02"}]
["R26",{"$f":"VLOOKUP(VALUE(MID($A45,2,2)),Bron!$A$2:$G$46,B$3+1,FALSE)","v":11},{"$f":"VLOOKUP(VALUE(MID($A45,2,2)),Bron!$A$2:$G$46,C$3+1,FALSE)","v":4},{"$f":"VLOOKUP(VALUE(MID($A45,2,2)),Bron!$A$2:$G$46,D$3+1,FALSE)","v":5},{"$f":"VLOOKUP(VALUE(MID($A45,2,2)),Bron!$A$2:$G$46,E$3+1,FALSE)","v":18},{"$f":"VLOOKUP(VALUE(MID($A45,2,2)),Bron!$A$2:$G$46,F$3+1,FALSE)","v":16},{"$f":"VLOOKUP(VALUE(MID($A45,2,2)),Bron!$A$2:$G$46,G$3+1,FALSE)","v":13},"11;04;05;18;16;13"]
["R27",{"$f":"VLOOKUP(VALUE(MID($A46,2,2)),Bron!$A$2:$G$46,B$3+1,FALSE)","v":6},{"$f":"VLOOKUP(VALUE(MID($A46,2,2)),Bron!$A$2:$G$46,C$3+1,FALSE)","v":7},{"$f":"VLOOKUP(VALUE(MID($A46,2,2)),Bron!$A$2:$G$46,D$3+1,FALSE)","v":17},{"$f":"VLOOKUP(VALUE(MID($A46,2,2)),Bron!$A$2:$G$46,E$3+1,FALSE)","v":9},{"$f":"VLOOKUP(VALUE(MID($A46,2,2)),Bron!$A$2:$G$46,F$3+1,FALSE)","v":15},{"$f":"VLOOKUP(VALUE(MID($A46,2,2)),Bron!$A$2:$G$46,G$3+1,FALSE)","v":12},"06;07;17;09;15;12"]
["Flight 10"]
[null,1.0,2.0,3.0,4.0,5.0,6.0]
["R28",{"$f":"VLOOKUP(VALUE(MID($A49,2,2)),Bron!$A$2:$G$46,B$3+1,FALSE)","v":3},{"$f":"VLOOKUP(VALUE(MID($A49,2,2)),Bron!$A$2:$G$46,C$3+1,FALSE)","v":13},{"$f":"VLOOKUP(VALUE(MID($A49,2,2)),Bron!$A$2:$G$46,D$3+1,FALSE)","v":17},{"$f":"VLOOKUP(VALUE(MID($A49,2,2)),Bron!$A$2:$G$46,E$3+1,FALSE)","v":16},{"$f":"VLOOKUP(VALUE(MID($A49,2,2)),Bron!$A$2:$G$46,F$3+1,FALSE)","v":14},{"$f":"VLOOKUP(VALUE(MID($A49,2,2)),Bron!$A$2:$G$46,G$3+1,FALSE)","v":10},{"$f":"TEXT(B49,\"00\")&\";\"&TEXT(C49,\"00\")&\";\"&TEXT(D49,\"00\")&\";\"&TEXT(E49,\"00\")&\";\"&TEXT(F49,\"00\")&\";\"&TEXT(G49,\"00\")","v":"03;13;17;16;14;10"}]
["R29",{"$f":"VLOOKUP(VALUE(MID($A50,2,2)),Bron!$A$2:$G$46,B$3+1,FALSE)","v":9},{"$f":"VLOOKUP(VALUE(MID($A50,2,2)),Bron!$A$2:$G$46,C$3+1,FALSE)","v":15},{"$f":"VLOOKUP(VALUE(MID($A50,2,2)),Bron!$A$2:$G$46,D$3+1,FALSE)","v":11},{"$f":"VLOOKUP(VALUE(MID($A50,2,2)),Bron!$A$2:$G$46,E$3+1,FALSE)","v":5},{"$f":"VLOOKUP(VALUE(MID($A50,2,2)),Bron!$A$2:$G$46,F$3+1,FALSE)","v":4},{"$f":"VLOOKUP(VALUE(MID($A50,2,2)),Bron!$A$2:$G$46,G$3+1,FALSE)","v":8},"09;15;11;05;04;08"]
["R30",{"$f":"VLOOKUP(VALUE(MID($A51,2,2)),Bron!$A$2:$G$46,B$3+1,FALSE)","v":6},{"$f":"VLOOKUP(VALUE(MID($A51,2,2)),Bron!$A$2:$G$46,C$3+1,FALSE)","v":18},{"$f":"VLOOKUP(VALUE(MID($A51,2,2)),Bron!$A$2:$G$46,D$3+1,FALSE)","v":7},{"$f":"VLOOKUP(VALUE(MID($A51,2,2)),Bron!$A$2:$G$46,E$3+1,FALSE)","v":1},{"$f":"VLOOKUP(VALUE(MID($A51,2,2)),Bron!$A$2:$G$46,F$3+1,FALSE)","v":2},{"$f":"VLOOKUP(VALUE(MID($A51,2,2)),Bron!$A$2:$G$46,G$3+1,FALSE)","v":12},"06;18;07;01;02;12"]
["Flight 11"]
[null,1.0,2.0,3.0,4.0,5.0,6.0]
["R31",{"$f":"VLOOKUP(VALUE(MID($A54,2,2)),Bron!$A$2:$G$46,B$3+1,FALSE)","v":9},{"$f":"VLOOKUP(VALUE(MID($A54,2,2)),Bron!$A$2:$G$46,C$3+1,FALSE)","v":3},{"$f":"VLOOKUP(VALUE(MID($A54,2,2)),Bron!$A$2:$G$46,D$3+1,FALSE)","v":5},{"$f":"VLOOKUP(VALUE(MID($A54,2,2)),Bron!$A$2:$G$46,E$3+1,FALSE)","v":1},{"$f":"VLOOKUP(VALUE(MID($A54,2,2)),Bron!$A$2:$G$46,F$3+1,FALSE)","v":15},{"$f":"VLOOKUP(VALUE(MID($A54,2,2)),Bron!$A$2:$G$46,G$3+1,FALSE)","v":14},{"$f":"TEXT(B54,\"00\")&\";\"&TEXT(C54,\"00\")&\";\"&TEXT(D54,\"00\")&\";\"&TEXT(E54,\"00\")&\";\"&TEXT(F54,\"00\")&\";\"&TEXT(G54,\"00\")","v":"09;03;05;01;15;14"}]
["R32",{"$f":"VLOOKUP(VALUE(MID($A55,2,2)),Bron!$A$2:$G$46,B$3+1,FALSE)","v":17},{"$f":"VLOOKUP(VALUE(MID($A55,2,2)),Bron!$A$2:$G$46,C$3+1,FALSE)","v":8},{"$f":"VLOOKUP(VALUE(MID($A55,2,2)),Bron!$A$2:$G$46,D$3+1,FALSE)","v":4},{"$f":"VLOOKUP(VALUE(MID($A55,2,2)),Bron!$A$2:$G$46,E$3+1,FALSE)","v":18},{"$f":"VLOOKUP(VALUE(MID($A55,2,2)),Bron!$A$2:$G$46,F$3+1,FALSE)","v":11},{"$f":"VLOOKUP(VALUE(MID($A55,2,2)),Bron!$A$2:$G$46,G$3+1,FALSE)","v":6},"17;08;04;18;11;06"]
["R33",{"$f":"VLOOKUP(VALUE(MID($A56,2,2)),Bron!$A$2:$G$46,B$3+1,FALSE)","v":12},{"$f":"VLOOKUP(VALUE(MID($A56,2,2)),Bron!$A$2:$G$46,C$3+1,FALSE)","v":7},{"$f":"VLOOKUP(VALUE(MID($A56,2,2)),Bron!$A$2:$G$46,D$3+1,FALSE)","v":10},{"$f":"VLOOKUP(VALUE(MID($A56,2,2)),Bron!$A$2:$G$46,E$3+1,FALSE)","v":2},{"$f":"VLOOKUP(VALUE(MID($A56,2,2)),Bron!$A$2:$G$46,F$3+1,FALSE)","v":16},{"$f":"VLOOKUP(VALUE(MID($A56,2,2)),Bron!$A$2:$G$46,G$3+1,FALSE)","v":13},"12;07;10;02;16;13"]
["Flight 12"]
[null,1.0,2.0,3.0,4.0,5.0,6.0]
["R34",{"$f":"VLOOKUP(VALUE(MID($A59,2,2)),Bron!$A$2:$G$46,B$3+1,FALSE)","v":12},{"$f":"VLOOKUP(VALUE(MID($A59,2,2)),Bron!$A$2:$G$46,C$3+1,FALSE)","v":3},{"$f":"VLOOKUP(VALUE(MID($A59,2,2)),Bron!$A$2:$G$46,D$3+1,FALSE)","v":17},{"$f":"VLOOKUP(VALUE(MID($A59,2,2)),Bron!$A$2:$G$46,E$3+1,FALSE)","v":2},{"$f":"VLOOKUP(VALUE(MID($A59,2,2)),Bron!$A$2:$G$46,F$3+1,FALSE)","v":11},{"$f":"VLOOKUP(VALUE(MID($A59,2,2)),Bron!$A$2:$G$46,G$3+1,FALSE)","v":13},{"$f":"TEXT(B59,\"00\")&\";\"&TEXT(C59,\"00\")&\";\"&TEXT(D59,\"00\")&\";\"&TEXT(E59,\"00\")&\";\"&TEXT(F59,\"00\")&\";\"&TEXT(G59,\"00\")","v":"12;03;17;02;11;13"}]
["R35",{"$f":"VLOOKUP(VALUE(MID($A60,2,2)),Bron!$A$2:$G$46,B$3+1,FALSE)","v":7},{"$f":"VLOOKUP(VALUE(MID($A60,2,2)),Bron!$A$2:$G$46,C$3+1,FALSE)","v":14},{"$f":"VLOOKUP(VALUE(MID($A60,2,2)),Bron!$A$2:$G$46,D$3+1,FALSE)","v":8},{"$f":"VLOOKUP(VALUE(MID($A60,2,2)),Bron!$A$2:$G$46,E$3+1,FALSE)","v":4},{"$f":"VLOOKUP(VALUE(MID($A60,2,2)),Bron!$A$2:$G$46,F$3+1,FALSE)","v":10},{"$f":"VLOOKUP(VALUE(MID($A60,2,2)),Bron!$A$2:$G$46,G$3+1,FALSE)","v":6},"07;14;08;04;10;06"]
["R36",{"$f":"VLOOKUP(VALUE(MID($A61,2,2)),Bron!$A$2:$G$46,B$3+1,FALSE)","v":16},{"$f":"VLOOKUP(VALUE(MID($A61,2,2)),Bron!$A$2:$G$46,C$3+1,FALSE)","v":5},{"$f":"VLOOKUP(VALUE(MID($A61,2,2)),Bron!$A$2:$G$46,D$3+1,FALSE)","v":18},{"$f":"VLOOKUP(VALUE(MID($A61,2,2)),Bron!$A$2:$G$46,E$3+1,FALSE)","v":9},{"$f":"VLOOKUP(VALUE(MID($A61,2,2)),Bron!$A$2:$G$46,F$3+1,FALSE)","v":1},{"$f":"VLOOKUP(VALUE(MID($A61,2,2)),Bron!$A$2:$G$46,G$3+1,FALSE)","v":15},"16;05;18;09;01;15"]
["Flight 13"]
[null,1.0,2.0,3.0,4.0,5.0,6.0]
["R37",{"$f":"VLOOKUP(VALUE(MID($A64,2,2)),Bron!$A$2:$G$46,B$3+1,FALSE)","v":16},{"$f":"VLOOKUP(VALUE(MID($A64,2,2)),Bron!$A$2:$G$46,C$3+1,FALSE)","v":8},{"$f":"VLOOKUP(VALUE(MID($A64,2,2)),Bron!$A$2:$G$46,D$3+1,FALSE)","v":11},{"$f":"VLOOKUP(VALUE(MID($A64,2,2)),Bron!$A$2:$G$46,E$3+1,FALSE)","v":3},{"$f":"VLOOKUP(VALUE(MID($A64,2,2)),Bron!$A$2:$G$46,F$3+1,FALSE)","v":1},{"$f":"VLOOKUP(VALUE(MID($A64,2,2)),Bron!$A$2:$G$46,G$3+1,FALSE)","v":17},{"$f":"TEXT(B64,\"00\")&\";\"&TEXT(C64,\"00\")&\";\"&TEXT(D64,\"00\")&\";\"&TEXT(E64,\"00\")&\";\"&TEXT(F64,\"00\")&\";\"&TEXT(G64,\"00\")","v":"16;08;11;03;01;17"}]
["R38",{"$f":"VLOOKUP(VALUE(MID($A65,2,2)),Bron!$A$2:$G$46,B$3+1,FALSE)","v":15},{"$f":"VLOOKUP(VALUE(MID($A65,2,2)),Bron!$A$2:$G$46,C$3+1,FALSE)","v":2},{"$f":"VLOOKUP(VALUE(MID($A65,2,2)),Bron!$A$2:$G$46,D$3+1,FALSE)","v":14},{"$f":"VLOOKUP(VALUE(MID($A65,2,2)),Bron!$A$2:$G$46,E$3+1,FALSE)","v":7},{"$f":"VLOOKUP(VALUE(MID($A65,2,2)),Bron!$A$2:$G$46,F$3+1,FALSE)","v":4},{"$f":"VLOOKUP(VALUE(MID($A65,2,2)),Bron!$A$2:$G$46,G$3+1,FALSE)","v":9},"15;02;14;07;04;09"]
["R39",{"$f":"VLOOKUP(VALUE(MID($A66,2,2)),Bron!$A$2:$G$46,B$3+1,FALSE)","v":5},{"$f":"VLOOKUP(VALUE(MID($A66,2,2)),Bron!$A$2:$G$46,C$3+1,FALSE)","v":6},{"$f":"VLOOKUP(VALUE(MID($A66,2,2)),Bron!$A$2:$G$46,D$3+1,FALSE)","v":13},{"$f":"VLOOKUP(VALUE(MID($A66,2,2)),Bron!$A$2:$G$46,E$3+1,FALSE)","v":10},{"$f":"VLOOKUP(VALUE(MID($A66,2,2)),Bron!$A$2:$G$46,F$3+1,FALSE)","v":12},{"$f":"VLOOKUP(VALUE(MID($A66,2,2)),Bron!$A$2:$G$46,G$3+1,FALSE)","v":18},"05;06;13;10;12;18"]
["Flight 14"]
[null,1.0,2.0,3.0,4.0,5.0,6.0]
["R40",{"$f":"VLOOKUP(VALUE(MID($A69,2,2)),Bron!$A$2:$G$46,B$3+1,FALSE)","v":3},{"$f":"VLOOKUP(VALUE(MID($A69,2,2)),Bron!$A$2:$G$46,C$3+1,FALSE)","v":7},{"$f":"VLOOKUP(VALUE(MID($A69,2,2)),Bron!$A$2:$G$46,D$3+1,FALSE)","v":13},{"$f":"VLOOKUP(VALUE(MID($A69,2,2)),Bron!$A$2:$G$46,E$3+1,FALSE)","v":15},{"$f":"VLOOKUP(VALUE(MID($A69,2,2)),Bron!$A$2:$G$46,F$3+1,FALSE)","v":8},{"$f":"VLOOKUP(VALUE(MID($A69,2,2)),Bron!$A$2:$G$46,G$3+1,FALSE)","v":18},{"$f":"TEXT(B69,\"00\")&\";\"&TEXT(C69,\"00\")&\";\"&TEXT(D69,\"00\")&\";\"&TEXT(E69,\"00\")&\";\"&TEXT(F69,\"00\")&\";\"&TEXT(G69,\"00\")","v":"03;07;13;15;08;18"}]
["R41",{"$f":"VLOOKUP(VALUE(MID($A70,2,2)),Bron!$A$2:$G$46,B$3+1,FALSE)","v":1},{"$f":"VLOOKUP(VALUE(MID($A70,2,2)),Bron!$A$2:$G$46,C$3+1,FALSE)","v":12},{"$f":"VLOOKUP(VALUE(MID($A70,2,2)),Bron!$A$2:$G$46,D$3+1,FALSE)","v":11},{"$f":"VLOOKUP(VALUE(MID($A70,2,2)),Bron!$A$2:$G$46,E$3+1,FALSE)","v":4},{"$f":"VLOOKUP(VALUE(MID($A70,2,2)),Bron!$A$2:$G$46,F$3+1,FALSE)","v":10},{"$f":"VLOOKUP(VALUE(MID($A70,2,2)),Bron!$A$2:$G$46,G$3+1,FALSE)","v":9},"01;12;11;04;10;09"]
["R42",{"$f":"VLOOKUP(VALUE(MID($A71,2,2)),Bron!$A$2:$G$46,B$3+1,FALSE)","v":5},{"$f":"VLOOKUP(VALUE(MID($A71,2,2)),Bron!$A$2:$G$46,C$3+1,FALSE)","v":14},{"$f":"VLOOKUP(VALUE(MID($A71,2,2)),Bron!$A$2:$G$46,D$3+1,FALSE)","v":16},{"$f":"VLOOKUP(VALUE(MID($A71,2,2)),Bron!$A$2:$G$46,E$3+1,FALSE)","v":6},{"$f":"VLOOKUP(VALUE(MID($A71,2,2)),Bron!$A$2:$G$46,F$3+1,FALSE)","v":17},{"$f":"VLOOKUP(VALUE(MID($A71,2,2)),Bron!$A$2:$G$46,G$3+1,FALSE)","v":2},"05;14;16;06;17;02"]
["Flight 15"]
[null,1.0,2.0,3.0,4.0,5.0,6.0]
["R43",{"$f":"VLOOKUP(VALUE(MID($A74,2,2)),Bron!$A$2:$G$46,B$3+1,FALSE)","v":15},{"$f":"VLOOKUP(VALUE(MID($A74,2,2)),Bron!$A$2:$G$46,C$3+1,FALSE)","v":13},{"$f":"VLOOKUP(VALUE(MID($A74,2,2)),Bron!$A$2:$G$46,D$3+1,FALSE)","v":9},{"$f":"VLOOKUP(VALUE(MID($A74,2,2)),Bron!$A$2:$G$46,E$3+1,FALSE)","v":6},{"$f":"VLOOKUP(VALUE(MID($A74,2,2)),Bron!$A$2:$G$46,F$3+1,FALSE)","v":10},{"$f":"VLOOKUP(VALUE(MID($A74,2,2)),Bron!$A$2:$G$46,G$3+1,FALSE)","v":11},{"$f":"TEXT(B74,\"00\")&\";\"&TEXT(C74,\"00\")&\";\"&TEXT(D74,\"00\")&\";\"&TEXT(E74,\"00\")&\";\"&TEXT(F74,\"00\")&\";\"&TEXT(G74,\"00\")","v":"15;13;09;06;10;11"}]
["R44",{"$f":"VLOOKUP(VALUE(MID($A75,2,2)),Bron!$A$2:$G$46,B$3+1,FALSE)","v":4},{"$f":"VLOOKUP(VALUE(MID($A75,2,2)),Bron!$A$2:$G$46,C$3+1,FALSE)","v":2},{"$f":"VLOOKUP(VALUE(MID($A75,2,2)),Bron!$A$2:$G$46,D$3+1,FALSE)","v":16},{"$f":"VLOOKUP(VALUE(MID($A75,2,2)),Bron!$A$2:$G$46,E$3+1,FALSE)","v":8},{"$f":"VLOOKUP(VALUE(MID($A75,2,2)),Bron!$A$2:$G$46,F$3+1,FALSE)","v":5},{"$f":"VLOOKUP(VALUE(MID($A75,2,2)),Bron!$A$2:$G$46,G$3+1,FALSE)","v":1},"04;02;16;08;05;01"]
["R45",{"$f":"VLOOKUP(VALUE(MID($A76,2,2)),Bron!$A$2:$G$46,B$3+1,FALSE)","v":14},{"$f":"VLOOKUP(VALUE(MID($A76,2,2)),Bron!$A$2:$G$46,C$3+1,FALSE)","v":18},{"$f":"VLOOKUP(VALUE(MID($A76,2,2)),Bron!$A$2:$G$46,D$3+1,FALSE)","v":7},{"$f":"VLOOKUP(VALUE(MID($A76,2,2)),Bron!$A$2:$G$46,E$3+1,FALSE)","v":17},{"$f":"VLOOKUP(VALUE(MID($A76,2,2)),Bron!$A$2:$G$46,F$3+1,FALSE)","v":12},{"$f":"VLOOKUP(VALUE(MID($A76,2,2)),Bron!$A$2:$G$46,G$3+1,FALSE)","v":3},"14;18;07;17;12;03"]

{"sheet":"Bron","index":3,"n_rows":46,"n_cols":16,"rows_kept":46,"cut":false,"hidden":false,"merged":[]}
["Race","Boot 1","Boot 2","Boot 3","Boot 4","Boot 5","Boot 6",null,"Wer segelt wie oft auf Boot x"]
[1.0,11.0,8.0,13.0,12.0,15.0,3.0,null,"Team","Boot 1","Boot 2","Boot 3","Boot 4","Boot 5","Boot 6","Total"]
[2.0,2.0,17.0,1.0,9.0,4.0,10.0,6.0,1.0,{"$f":"COUNTIF(B:B,$I3)","v":2},1,1,4,4,3,{"$f":"SUM(J3:O3)","v":15}]
[3.0,7.0,6.0,16.0,14.0,18.0,5.0,4.0,2.0,{"$f":"COUNTIF(B:B,$I4)","v":1},3,2,4,3,2,15]
[4.0,7.0,3.0,2.0,11.0,18.0,1.0,6.0,3.0,{"$f":"COUNTIF(B:B,$I5)","v":3},3,3,2,2,2,15]
[5.0,12.0,13.0,14.0,4.0,9.0,16.0,6.0,4.0,{"$f":"COUNTIF(B:B,$I6)","v":1},4,2,3,3,2,15]
[6.0,10.0,5.0,6.0,17.0,8.0,15.0,4.0,5.0,{"$f":"COUNTIF(B:B,$I7)","v":3},3,2,2,3,2,15]
[7.0,13.0,5.0,6.0,3.0,2.0,9.0,6.0,6.0,{"$f":"COUNTIF(B:B,$I8)","v":3},3,3,3,1,2,15]
[8.0,11.0,4.0,15.0,7.0,14.0,17.0,6.0,7.0,{"$f":"COUNTIF(B:B,$I9)","v":4},3,3,3,1,1,15]
[9.0,18.0,12.0,10.0,8.0,1.0,16.0,4.0,8.0,{"$f":"COUNTIF(B:B,$I10)","v":1},4,3,3,3,1,15]
[10.0,7.0,9.0,17.0,8.0,3.0,16.0,6.0,9.0,{"$f":"COUNTIF(B:B,$I11)","v":3},1,3,3,1,4,15]
[11.0,18.0,2.0,4.0,15.0,13.0,10.0,6.0,10.0,{"$f":"COUNTIF(B:B,$I12)","v":2},1,2,3,4,3,15]
[12.0,1.0,6.0,12.0,5.0,14.0,11.0,4.0,11.0,{"$f":"COUNTIF(B:B,$I13)","v":3},1,3,2,2,4,15]
[13.0,9.0,10.0,3.0,18.0,14.0,11.0,6.0,12.0,{"$f":"COUNTIF(B:B,$I14)","v":4},2,1,1,3,4,15]
[14.0,8.0,4.0,7.0,13.0,6.0,1.0,6.0,13.0,{"$f":"COUNTIF(B:B,$I15)","v":2},3,4,1,1,4,15]
[15.0,15.0,16.0,2.0,17.0,5.0,12.0,4.0,14.0,{"$f":"COUNTIF(B:B,$I16)","v":2},2,3,2,4,2,15]
[16.0,10.0,4.0,3.0,7.0,5.0,12.0,6.0,15.0,{"$f":"COUNTIF(B:B,$I17)","v":3},3,2,2,3,2,15]
[17.0,6.0,11.0,8.0,2.0,16.0,9.0,6.0,16.0,{"$f":"COUNTIF(B:B,$I18)","v":4},1,3,1,3,3,15]
[18.0,17.0,15.0,14.0,1.0,18.0,13.0,4.0,17.0,{"$f":"COUNTIF(B:B,$I19)","v":2},3,4,3,1,2,15]
[19.0,16.0,15.0,6.0,1.0,3.0,4.0,6.0,18.0,{"$f":"COUNTIF(B:B,$I20)","v":2},4,1,3,3,2,15]
[20.0,5.0,17.0,13.0,11.0,10.0,7.0,6.0]
[21.0,12.0,18.0,9.0,2.0,8.0,14.0,4.0]
[22.0,3.0,18.0,9.0,6.0,12.0,4.0,6.0]
[23.0,13.0,1.0,8.0,14.0,2.0,5.0,6.0]
[24.0,16.0,17.0,15.0,10.0,7.0,11.0,5.0]
[25.0,14.0,8.0,3.0,10.0,1.0,2.0,6.0]
[26.0,11.0,4.0,5.0,18.0,16.0,13.0,6.0]
[27.0,6.0,7.0,17.0,9.0,15.0,12.0,5.0]
[28.0,3.0,13.0,17.0,16.0,14.0,10.0,6.0]
[29.0,9.0,15.0,11.0,5.0,4.0,8.0,6.0]
[30.0,6.0,18.0,7.0,1.0,2.0,12.0,5.0]
[31.0,9.0,3.0,5.0,1.0,15.0,14.0,6.0]
[32.0,17.0,8.0,4.0,18.0,11.0,6.0,6.0]
[33.0,12.0,7.0,10.0,2.0,16.0,13.0,4.0]
[34.0,12.0,3.0,17.0,2.0,11.0,13.0,6.0]
[35.0,7.0,14.0,8.0,4.0,10.0,6.0,6.0]
[36.0,16.0,5.0,18.0,9.0,1.0,15.0,4.0]
[37.0,16.0,8.0,11.0,3.0,1.0,17.0,6.0]
[38.0,15.0,2.0,14.0,7.0,4.0,9.0,6.0]
[39.0,5.0,6.0,13.0,10.0,12.0,18.0,5.0]
[40.0,3.0,7.0,13.0,15.0,8.0,18.0,6.0]
[41.0,1.0,12.0,11.0,4.0,10.0,9.0,6.0]
[42.0,5.0,14.0,16.0,6.0,17.0,2.0,5.0]
[43.0,15.0,13.0,9.0,6.0,10.0,11.0,6.0]
[44.0,4.0,2.0,16.0,8.0,5.0,1.0,6.0]
[45.0,14.0,18.0,7.0,17.0,12.0,3.0]