{"text_format":"2","workbook":"xlsx","n_sheets":4,"sheets":["PAIRING LIST","Deelnemers","Kontrollmatrix","Bron"],"not_rendered":{"charts":0,"images":0,"macros":0,"external_links":0,"defined_names":0,"comments":0,"pivot_tables":0},"unopened":[],"bounds":{"document_bytes":16777216,"sheet_cells":100000,"run_cost":"one","rows_first":2000,"rows_last":500,"rows_between":2000,"halvings":0,"cell_chars":16384,"cell_head_chars":4096},"cells_cut":0,"cells_raw":0,"read":"whole","date_system":"1900"}

{"sheet":"PAIRING LIST","index":0,"n_rows":76,"n_cols":8,"rows_kept":76,"cut":false,"hidden":false,"merged":[]}
["00:30:00"]
["Intended",{"$f":"Kontrollmatrix!A2","v":"Flight 1"}]
["Starttime","Race","Boot 1","Boot 2","Boot 3","Boot 4","Boot 5","Boot 6"]
["10:00:00",{"$f":"1+B1","v":1},{"$f":"VLOOKUP(Kontrollmatrix!B4,Deelnemers!$A$2:$C$19,2,FALSE)","v":"Team 11"},{"$f":"VLOOKUP(Kontrollmatrix!C4,Deelnemers!$A$2:$C$19,2,FALSE)","v":"Team 8"},{"$f":"VLOOKUP(Kontrollmatrix!D4,Deelnemers!$A$2:$C$19,2,FALSE)","v":"Team 13"},{"$f":"VLOOKUP(Kontrollmatrix!E4,Deelnemers!$A$2:$C$19,2,FALSE)","v":"Team 12"},{"$f":"VLOOKUP(Kontrollmatrix!F4,Deelnemers!$A$2:$C$19,2,FALSE)","v":"Team 15"},{"$f":"VLOOKUP(Kontrollmatrix!G4,Deelnemers!$A$2:$C$19,2,FALSE)","v":"Team 3"}]
[{"$f":"A4+$A$1","v":"10:30:00"},{"$f":"B4+1","v":2},{"$f":"VLOOKUP(Kontrollmatrix!B5,Deelnemers!$A$2:$C$19,2,FALSE)","v":"Team 2"},{"$f":"VLOOKUP(Kontrollmatrix!C5,Deelnemers!$A$2:$C$19,2,FALSE)","v":"Team 17"},{"$f":"VLOOKUP(Kontrollmatrix!D5,Deelnemers!$A$2:$C$19,2,FALSE)","v":"Team 1"},{"$f":"VLOOKUP(Kontrollmatrix!E5,Deelnemers!$A$2:$C$19,2,FALSE)","v":"Team 9"},{"$f":"VLOOKUP(Kontrollmatrix!F5,Deelnemers!$A$2:$C$19,2,FALSE)","v":"Team 4"},{"$f":"VLOOKUP(Kontrollmatrix!G5,Deelnemers!$A$2:$C$19,2,FALSE)","v":"Team 10"}]
["11:00:00",3,{"$f":"VLOOKUP(Kontrollmatrix!B6,Deelnemers!$A$2:$C$19,2,FALSE)","v":"Team 7"},{"$f":"VLOOKUP(Kontrollmatrix!C6,Deelnemers!$A$2:$C$19,2,FALSE)","v":"Team 6"},{"$f":"VLOOKUP(Kontrollmatrix!D6,Deelnemers!$A$2:$C$19,2,FALSE)","v":"Team 16"},{"$f":"VLOOKUP(Kontrollmatrix!E6,Deelnemers!$A$2:$C$19,2,FALSE)","v":"Team 14"},{"$f":"VLOOKUP(Kontrollmatrix!F6,Deelnemers!$A$2:$C$19,2,FALSE)","v":"Team 18"},{"$f":"VLOOKUP(Kontrollmatrix!G6,Deelnemers!$A$2:$C$19,2,FALSE)","v":"Team 5"}]
[null,{"$f":"Kontrollmatrix!A7","v":"Flight 2"}]
[null,"Race","Boot 1","Boot 2","Boot 3","Boot 4","Boot 5","Boot 6"]
[{"$f":"A6+$A$1","v":"11:30:00"},{"$f":"1+B6","v":4},{"$f":"VLOOKUP(Kontrollmatrix!B9,Deelnemers!$A$2:$C$19,2,FALSE)","v":"Team 7"},{"$f":"VLOOKUP(Kontrollmatrix!C9,Deelnemers!$A$2:$C$19,2,FALSE)","v":"Team 3"},{"$f":"VLOOKUP(Kontrollmatrix!D9,Deelnemers!$A$2:$C$19,2,FALSE)","v":"Team 2"},{"$f":"VLOOKUP(Kontrollmatrix!E9,Deelnemers!$A$2:$C$19,2,FALSE)","v":"Team 11"},{"$f":"VLOOKUP(Kontrollmatrix!F9,Deelnemers!$A$2:$C$19,2,FALSE)","v":"Team 18"},{"$f":"VLOOKUP(Kontrollmatrix!G9,Deelnemers!$A$2:$C$19,2,FALSE)","v":"Team 1"}]
[{"$f":"A9+$A$1","v":"12:00:00"},{"$f":"B9+1","v":5},{"$f":"VLOOKUP(Kontrollmatrix!B10,Deelnemers!$A$2:$C$19,2,FALSE)","v":"Team 12"},{"$f":"VLOOKUP(Kontrollmatrix!C10,Deelnemers!$A$2:$C$19,2,FALSE)","v":"Team 13"},{"$f":"VLOOKUP(Kontrollmatrix!D10,Deelnemers!$A$2:$C$19,2,FALSE)","v":"Team 14"},{"$f":"VLOOKUP(Kontrollmatrix!E10,Deelnemers!$A$2:$C$19,2,FALSE)","v":"Team 4"},{"$f":"VLOOKUP(Kontrollmatrix!F10,Deelnemers!$A$2:$C$19,2,FALSE)","v":"Team 9"},{"$f":"VLOOKUP(Kontrollmatrix!G10,Deelnemers!$A$2:$C$19,2,FALSE)","v":"Team 16"}]
{"$rows_left_out":67}
{"sheet":"Deelnemers","index":1,"n_rows":19,"n_cols":2,"rows_kept":19,"cut":false,"hidden":false,"merged":[]}
["ID","Name"]
[1.0,"Team 1"]
[2.0,"Team 2"]
[3.0,"Team 3"]
[4.0,"Team 4"]
[5.0,"Team 5"]
[6.0,"Team 6"]
[7.0,"Team 7"]
[8.0,"Team 8"]
[9.0,"Team 9"]
{"$rows_left_out":10}
{"sheet":"Kontrollmatrix","index":2,"n_rows":76,"n_cols":27,"rows_kept":76,"cut":false,"hidden":false,"merged":[]}
[{"$nulls":6},"Quelle der Pairings: Florian Haufe 09.05.2014",null,"Kontrollparameter"]
["Flight 1",{"$nulls":7},{"$f":"1-COUNTIF($J$9:$AA$26,0)/1830","v":1},"Effizienz der Pairings"]
[null,1.0,2.0,3.0,4.0,5.0,6.0,null,{"$f":"COUNT($J$9:$AA$26)-COUNTIF($J$9:$AA$26,0)","v":153},"1 zu 1 Begegnungen"]
["R1",{"$f":"VLOOKUP(VALUE(MID($A4,2,2)),Bron!$A$2:$G$46,B$3+1,FALSE)","v":11},{"$f":"VLOOKUP(VALUE(MID($A4,2,2)),Bron!$A$2:$G$46,C$3+1,FALSE)","v":8},{"$f":"VLOOKUP(VALUE(MID($A4,2,2)),Bron!$A$2:$G$46,D$3+1,FALSE)","v":13},{"$f":"VLOOKUP(VALUE(MID($A4,2,2)),Bron!$A$2:$G$46,E$3+1,FALSE)","v":12},{"$f":"VLOOKUP(VALUE(MID($A4,2,2)),Bron!$A$2:$G$46,F$3+1,FALSE)","v":15},{"$f":"VLOOKUP(VALUE(MID($A4,2,2)),Bron!$A$2:$G$46,G$3+1,FALSE)","v":3},{"$f":"TEXT(B4,\"00\")&\";\"&TEXT(C4,\"00\")&\";\"&TEXT(D4,\"00\")&\";\"&TEXT(E4,\"00\")&\";\"&TEXT(F4,\"00\")&\";\"&TEXT(G4,\"00\")","v":"11;08;13;12;15;03"},{"$f":"MIN($J$9:$AA$26)","v":3},"Min. Anzahl einer 1 zu 1 Begegnung"]
["R2",{"$f":"VLOOKUP(VALUE(MID($A5,2,2)),Bron!$A$2:$G$46,B$3+1,FALSE)","v":2},{"$f":"VLOOKUP(VALUE(MID($A5,2,2)),Bron!$A$2:$G$46,C$3+1,FALSE)","v":17},{"$f":"VLOOKUP(VALUE(MID($A5,2,2)),Bron!$A$2:$G$46,D$3+1,FALSE)","v":1},{"$f":"VLOOKUP(VALUE(MID($A5,2,2)),Bron!$A$2:$G$46,E$3+1,FALSE)","v":9},{"$f":"VLOOKUP(VALUE(MID($A5,2,2)),Bron!$A$2:$G$46,F$3+1,FALSE)","v":4},{"$f":"VLOOKUP(VALUE(MID($A5,2,2)),Bron!$A$2:$G$46,G$3+1,FALSE)","v":10},"02;17;01;09;04;10",{"$f":"MAX($J$9:$AA$26)","v":6},"Max. Anzahl einer 1 zu 1 Begegnung"]
["R3",{"$f":"VLOOKUP(VALUE(MID($A6,2,2)),Bron!$A$2:$G$46,B$3+1,FALSE)","v":7},{"$f":"VLOOKUP(VALUE(MID($A6,2,2)),Bron!$A$2:$G$46,C$3+1,FALSE)","v":6},{"$f":"VLOOKUP(VALUE(MID($A6,2,2)),Bron!$A$2:$G$46,D$3+1,FALSE)","v":16},{"$f":"VLOOKUP(VALUE(MID($A6,2,2)),Bron!$A$2:$G$46,E$3+1,FALSE)","v":14},{"$f":"VLOOKUP(VALUE(MID($A6,2,2)),Bron!$A$2:$G$46,F$3+1,FALSE)","v":18},{"$f":"VLOOKUP(VALUE(MID($A6,2,2)),Bron!$A$2:$G$46,G$3+1,FALSE)","v":5},"07;06;16;14;18;05",{"$f":"STDEVP(J9:AA26)","v":0.7882255389},"Standardabw."]
["Flight 2",{"$nulls":7},"Kontrollmatrix der 1 zu 1 Begegnungen"]
[null,1.0,2.0,3.0,4.0,5.0,6.0,null,"-","01","02","03","04","05","06","07","08","09","10","11","12","13","14","15","16","17","18"]
["R4",{"$f":"VLOOKUP(VALUE(MID($A9,2,2)),Bron!$A$2:$G$46,B$3+1,FALSE)","v":7},{"$f":"VLOOKUP(VALUE(MID($A9,2,2)),Bron!$A$2:$G$46,C$3+1,FALSE)","v":3},{"$f":"VLOOKUP(VALUE(MID($A9,2,2)),Bron!$A$2:$G$46,D$3+1,FALSE)","v":2},{"$f":"VLOOKUP(VALUE(MID($A9,2,2)),Bron!$A$2:$G$46,E$3+1,FALSE)","v":11},{"$f":"VLOOKUP(VALUE(MID($A9,2,2)),Bron!$A$2:$G$46,F$3+1,FALSE)","v":18},{"$f":"VLOOKUP(VALUE(MID($A9,2,2)),Bron!$A$2:$G$46,G$3+1,FALSE)","v":1},{"$f":"TEXT(B9,\"00\")&\";\"&TEXT(C9,\"00\")&\";\"&TEXT(D9,\"00\")&\";\"&TEXT(E9,\"00\")&\";\"&TEXT(F9,\"00\")&\";\"&TEXT(G9,\"00\")","v":"07;03;02;11;18;01"},"01",null,{"$f":"IF(AND(ISNUMBER(FIND(K$8,$H$4)),ISNUMBER(FIND($I9,$H$4))),1,0)+IF(AND(ISNUMBER(FIND(K$8,$H$5)),ISNUMBER(FIND($I9,$H$5))),1,0)+IF(AND(ISNUMBER(FIND(K$8,$H$6)),ISNUMBER(FIND($I9,$H$6))),1,0)+IF(AND(ISNUMBER(FIND(K$8,$H$7)),ISNUMBER(FIND($I9,$H$7))),1,0)+IF(AND(ISNUMBER(FIND(K$8,$H$8)),ISNUMBER(FIND($I9,$H$8))),1,0)+IF(AND(ISNUMBER(FIND(K$8,$H$9)),ISNUMBER(FIND($I9,$H$9))),1,0)+IF(AND(ISNUMBER(FIND(K$8,$H$10)),ISNUMBER(FIND($I9,$H$10))),1,0)+IF(AND(ISNUMBER(FIND(K$8,$H$11)),ISNUMBER(FIND($I9,$H$11))),1,0)+IF(AND(ISNUMBER(FIND(K$8,$H$12)),ISNUMBER(FIND($I9,$H$12))),1,0)+IF(AND(ISNUMBER(FIND(K$8,$H$13)),ISNUMBER(FIND($I9,$H$13))),1,0)+IF(AND(ISNUMBER(FIND(K$8,$H$14)),ISNUMBER(FIND($I9,$H$14))),1,0)+IF(AND(ISNUMBER(FIND(K$8,$H$15)),ISNUMBER(FIND($I9,$H$15))),1,0)+IF(AND(ISNUMBER(FIND(K$8,$H$16)),ISNUMBER(FIND($I9,$H$16))),1,0)+IF(AND(ISNUMBER(FIND(K$8,$H$17)),ISNUMBER(FIND($I9,$H$17))),1,0)+IF(AND(ISNUMBER(FIND(K$8,$H$18)),ISNUMBER(FIND($I9,$H$18))),1,0)+IF(AND(ISNUMBER(FIND(K$8,$H$19)),ISNUMBER(FIND($I9,$H$19))),1,0)+IF(AND(ISNUMBER(FIND(K$8,$H$20)),ISNUMBER(FIND($I9,$H$20))),1,0)+IF(AND(ISNUMBER(FIND(K$8,$H$21)),ISNUMBER(FIND($I9,$H$21))),1,0)+IF(AND(ISNUMBER(FIND(K$8,$H$22)),ISNUMBER(FIND($I9,$H$22))),1,0)+IF(AND(ISNUMBER(FIND(K$8,$H$23)),ISNUMBER(FIND($I9,$H$23))),1,0)+IF(AND(ISNUMBER(FIND(K$8,$H$24)),ISNUMBER(FIND($I9,$H$24))),1,0)+IF(AND(ISNUMBER(FIND(K$8,$H$25)),ISNUMBER(FIND($I9,$H$25))),1,0)+IF(AND(ISNUMBER(FIND(K$8,$H$26)),ISNUMBER(FIND($I9,$H$26))),1,0)+IF(AND(ISNUMBER(FIND(K$8,$H$27)),ISNUMBER(FIND($I9,$H$27))),1,0)+IF(AND(ISNUMBER(FIND(K$8,$H$28)),ISNUMBER(FIND($I9,$H$28))),1,0)+IF(AND(ISNUMBER(FIND(K$8,$H$29)),ISNUMBER(FIND($I9,$H$29))),1,0)+IF(AND(ISNUMBER(FIND(K$8,$H$30)),ISNUMBER(FIND($I9,$H$30))),1,0)+IF(AND(ISNUMBER(FIND(K$8,$H$31)),ISNUMBER(FIND($I9,$H$31))),1,0)+IF(AND(ISNUMBER(FIND(K$8,$H$32)),ISNUMBER(FIND($I9,$H$32))),1,0)+IF(AND(ISNUMBER(FIND(K$8,$H$33)),ISNUMBER(FIND($I9,$H$33))),1,0)+IF(AND(ISNUMBER(FIND(K$8,$H$34)),ISNUMBER(FIND($I9,$H$34))),1,0)+IF(AND(ISNUMBER(FIND(K$8,$H$35)),ISNUMBER(FIND($I9,$H$35))),1,0)+IF(AND(ISNUMBER(FIND(K$8,$H$36)),ISNUMBER(FIND($I9,$H$36))),1,0)+IF(AND(ISNUMBER(FIND(K$8,$H$37)),ISNUMBER(FIND($I9,$H$37))),1,0)+IF(AND(ISNUMBER(FIND(K$8,$H$38)),ISNUMBER(FIND($I9,$H$38))),1,0)+IF(AND(ISNUMBER(FIND(K$8,$H$39)),ISNUMBER(FIND($I9,$H$39))),1,0)+IF(AND(ISNUMBER(FIND(K$8,$H$40)),ISNUMBER(FIND($I9,$H$40))),1,0)+IF(AND(ISNUMBER(FIND(K$8,$H$41)),ISNUMBER(FIND($I9,$H$41))),1,0)+IF(AND(ISNUMBER(FIND(K$8,$H$42)),ISNUMBER(FIND($I9,$H$42))),1,0)+IF(AND(ISNUMBER(FIND(K$8,$H$43)),ISNUMBER(FIND($I9,$H$43))),1,0)+IF(AND(ISNUMBER(FIND(K$8,$H$44)),ISNUMBER(FIND($I9,$H$44))),1,0)+IF(AND(ISNUMBER(FIND(K$8,$H$45)),ISNUMBER(FIND($I9,$H$45))),1,0)+IF(AND(ISNUMBER(FIND(K$8,$H$46)),ISNUMBER(FIND($I9,$H$46))),1,0)+IF(AND(ISNUMBER(FIND(K$8,$H$47)),ISNUMBER(FIND($I9,$H$47))),1,0)+IF(AND(ISNUMBER(FIND(K$8,$H$48)),ISNUMBER(FIND($I9,$H$48))),1,0)+IF(AND(ISNUMBER(FIND(K$8,$H$49)),ISNUMBER(FIND($I9,$H$49))),1,0)+IF(AND(ISNUMBER(FIND(K$8,$H$50)),ISNUMBER(FIND($I9,$H$50))),1,0)+IF(AND(ISNUMBER(FIND(K$8,$H$51)),ISNUMBER(FIND($I9,$H$51))),1,0)+IF(AND(ISNUMBER(FIND(K$8,$H$52)),ISNUMBER(FIND($I9,$H$52))),1,0)+IF(AND(ISNUMBER(FIND(K$8,$H$53)),ISNUMBER(FIND($I9,$H$53))),1,0)+IF(AND(ISNUMBER(FIND(K$8,$H$54)),ISNUMBER(FIND($I9,$H$54))),1,0)+IF(AND(ISNUMBER(FIND(K$8,$H$55)),ISNUMBER(FIND($I9,$H$55))),1,0)+IF(AND(ISNUMBER(FIND(K$8,$H$56)),ISNUMBER(FIND($I9,$H$56))),1,0)+IF(AND(ISNUMBER(FIND(K$8,$H$57)),ISNUMBER(FIND($I9,$H$57))),1,0)+IF(AND(ISNUMBER(FIND(K$8,$H$58)),ISNUMBER(FIND($I9,$H$58))),1,0)+IF(AND(ISNUMBER(FIND(K$8,$H$59)),ISNUMBER(FIND($I9,$H$59))),1,0)+IF(AND(ISNUMBER(FIND(K$8,$H$60)),ISNUMBER(FIND($I9,$H$60))),1,0)+IF(AND(ISNUMBER(FIND(K$8,$H$61)),ISNUMBER(FIND($I9,$H$61))),1,0)+IF(AND(ISNUMBER(FIND(K$8,$H$62)),ISNUMBER(FIND($I9,$H$62))),1,0)+IF(AND(ISNUMBER(FIND(K$8,$H$63)),ISNUMBER(FIND($I9,$H$63))),1,0)+IF(AND(ISNUMBER(FIND(K$8,$H$64)),ISNUMBER(FIND($I9,$H$64))),1,0)+IF(AND(ISNUMBER(FIND(K$8,$H$65)),ISNUMBER(FIND($I9,$H$65))),1,0)+IF(AND(ISNUMBER(FIND(K$8,$H$66)),ISNUMBER(FIND($I9,$H$66))),1,0)+IF(AND(ISNUMBER(FIND(K$8,$H$67)),ISNUMBER(FIND($I9,$H$67))),1,0)+IF(AND(ISNUMBER(FIND(K$8,$H$68)),ISNUMBER(FIND($I9,$H$68))),1,0)+IF(AND(ISNUMBER(FIND(K$8,$H$69)),ISNUMBER(FIND($I9,$H$69))),1,0)+IF(AND(ISNUMBER(FIND(K$8,$H$70)),ISNUMBER(FIND($I9,$H$70))),1,0)+IF(AND(ISNUMBER(FIND(K$8,$H$71)),ISNUMBER(FIND($I9,$H$71))),1,0)+IF(AND(ISNUMBER(FIND(K$8,$H$72)),ISNUMBER(FIND($I9,$H$72))),1,0)+IF(AND(ISNUMBER(FIND(K$8,$H$73)),ISNUMBER(FIND($I9,$H$73))),1,0)+IF(AND(ISNUMBER(FIND(K$8,$H$74)),ISNUMBER(FIND($I9,$H$74))),1,0)+IF(AND(ISNUMBER(FIND(K$8,$H$75)),ISNUMBER(FIND($I9,$H$75))),1,0)+IF(AND(ISNUMBER(FIND(K$8,$H$76)),ISNUMBER(FIND($I9,$H$76))),1,0)","v":6},5,5,5,4,3,6,4,4,4,4,3,5,4,5,3,5]
["R5",{"$f":"VLOOKUP(VALUE(MID($A10,2,2)),Bron!$A$2:$G$46,B$3+1,FALSE)","v":12},{"$f":"VLOOKUP(VALUE(MID($A10,2,2)),Bron!$A$2:$G$46,C$3+1,FALSE)","v":13},{"$f":"VLOOKUP(VALUE(MID($A10,2,2)),Bron!$A$2:$G$46,D$3+1,FALSE)","v":14},{"$f":"VLOOKUP(VALUE(MID($A10,2,2)),Bron!$A$2:$G$46,E$3+1,FALSE)","v":4},{"$f":"VLOOKUP(VALUE(MID($A10,2,2)),Bron!$A$2:$G$46,F$3+1,FALSE)","v":9},{"$f":"VLOOKUP(VALUE(MID($A10,2,2)),Bron!$A$2:$G$46,G$3+1,FALSE)","v":16},"12;13;14;04;09;16","02",null,null,{"$f":"IF(AND(ISNUMBER(FIND(L$8,$H$4)),ISNUMBER(FIND($I10,$H$4))),1,0)+IF(AND(ISNUMBER(FIND(L$8,$H$5)),ISNUMBER(FIND($I10,$H$5))),1,0)+IF(AND(ISNUMBER(FIND(L$8,$H$6)),ISNUMBER(FIND($I10,$H$6))),1,0)+IF(AND(ISNUMBER(FIND(L$8,$H$7)),ISNUMBER(FIND($I10,$H$7))),1,0)+IF(AND(ISNUMBER(FIND(L$8,$H$8)),ISNUMBER(FIND($I10,$H$8))),1,0)+IF(AND(ISNUMBER(FIND(L$8,$H$9)),ISNUMBER(FIND($I10,$H$9))),1,0)+IF(AND(ISNUMBER(FIND(L$8,$H$10)),ISNUMBER(FIND($I10,$H$10))),1,0)+IF(AND(ISNUMBER(FIND(L$8,$H$11)),ISNUMBER(FIND($I10,$H$11))),1,0)+IF(AND(ISNUMBER(FIND(L$8,$H$12)),ISNUMBER(FIND($I10,$H$12))),1,0)+IF(AND(ISNUMBER(FIND(L$8,$H$13)),ISNUMBER(FIND($I10,$H$13))),1,0)+IF(AND(ISNUMBER(FIND(L$8,$H$14)),ISNUMBER(FIND($I10,$H$14))),1,0)+IF(AND(ISNUMBER(FIND(L$8,$H$15)),ISNUMBER(FIND($I10,$H$15))),1,0)+IF(AND(ISNUMBER(FIND(L$8,$H$16)),ISNUMBER(FIND($I10,$H$16))),1,0)+IF(AND(ISNUMBER(FIND(L$8,$H$17)),ISNUMBER(FIND($I10,$H$17))),1,0)+IF(AND(ISNUMBER(FIND(L$8,$H$18)),ISNUMBER(FIND($I10,$H$18))),1,0)+IF(AND(ISNUMBER(FIND(L$8,$H$19)),ISNUMBER(FIND($I10,$H$19))),1,0)+IF(AND(ISNUMBER(FIND(L$8,$H$20)),ISNUMBER(FIND($I10,$H$20))),1,0)+IF(AND(ISNUMBER(FIND(L$8,$H$21)),ISNUMBER(FIND($I10,$H$21))),1,0)+IF(AND(ISNUMBER(FIND(L$8,$H$22)),ISNUMBER(FIND($I10,$H$22))),1,0)+IF(AND(ISNUMBER(FIND(L$8,$H$23)),ISNUMBER(FIND($I10,$H$23))),1,0)+IF(AND(ISNUMBER(FIND(L$8,$H$24)),ISNUMBER(FIND($I10,$H$24))),1,0)+IF(AND(ISNUMBER(FIND(L$8,$H$25)),ISNUMBER(FIND($I10,$H$25))),1,0)+IF(AND(ISNUMBER(FIND(L$8,$H$26)),ISNUMBER(FIND($I10,$H$26))),1,0)+IF(AND(ISNUMBER(FIND(L$8,$H$27)),ISNUMBER(FIND($I10,$H$27))),1,0)+IF(AND(ISNUMBER(FIND(L$8,$H$28)),ISNUMBER(FIND($I10,$H$28))),1,0)+IF(AND(ISNUMBER(FIND(L$8,$H$29)),ISNUMBER(FIND($I10,$H$29))),1,0)+IF(AND(ISNUMBER(FIND(L$8,$H$30)),ISNUMBER(FIND($I10,$H$30))),1,0)+IF(AND(ISNUMBER(FIND(L$8,$H$31)),ISNUMBER(FIND($I10,$H$31))),1,0)+IF(AND(ISNUMBER(FIND(L$8,$H$32)),ISNUMBER(FIND($I10,$H$32))),1,0)+IF(AND(ISNUMBER(FIND(L$8,$H$33)),ISNUMBER(FIND($I10,$H$33))),1,0)+IF(AND(ISNUMBER(FIND(L$8,$H$34)),ISNUMBER(FIND($I10,$H$34))),1,0)+IF(AND(ISNUMBER(FIND(L$8,$H$35)),ISNUMBER(FIND($I10,$H$35))),1,0)+IF(AND(ISNUMBER(FIND(L$8,$H$36)),ISNUMBER(FIND($I10,$H$36))),1,0)+IF(AND(ISNUMBER(FIND(L$8,$H$37)),ISNUMBER(FIND($I10,$H$37))),1,0)+IF(AND(ISNUMBER(FIND(L$8,$H$38)),ISNUMBER(FIND($I10,$H$38))),1,0)+IF(AND(ISNUMBER(FIND(L$8,$H$39)),ISNUMBER(FIND($I10,$H$39))),1,0)+IF(AND(ISNUMBER(FIND(L$8,$H$40)),ISNUMBER(FIND($I10,$H$40))),1,0)+IF(AND(ISNUMBER(FIND(L$8,$H$41)),ISNUMBER(FIND($I10,$H$41))),1,0)+IF(AND(ISNUMBER(FIND(L$8,$H$42)),ISNUMBER(FIND($I10,$H$42))),1,0)+IF(AND(ISNUMBER(FIND(L$8,$H$43)),ISNUMBER(FIND($I10,$H$43))),1,0)+IF(AND(ISNUMBER(FIND(L$8,$H$44)),ISNUMBER(FIND($I10,$H$44))),1,0)+IF(AND(ISNUMBER(FIND(L$8,$H$45)),ISNUMBER(FIND($I10,$H$45))),1,0)+IF(AND(ISNUMBER(FIND(L$8,$H$46)),ISNUMBER(FIND($I10,$H$46))),1,0)+IF(AND(ISNUMBER(FIND(L$8,$H$47)),ISNUMBER(FIND($I10,$H$47))),1,0)+IF(AND(ISNUMBER(FIND(L$8,$H$48)),ISNUMBER(FIND($I10,$H$48))),1,0)+IF(AND(ISNUMBER(FIND(L$8,$H$49)),ISNUMBER(FIND($I10,$H$49))),1,0)+IF(AND(ISNUMBER(FIND(L$8,$H$50)),ISNUMBER(FIND($I10,$H$50))),1,0)+IF(AND(ISNUMBER(FIND(L$8,$H$51)),ISNUMBER(FIND($I10,$H$51))),1,0)+IF(AND(ISNUMBER(FIND(L$8,$H$52)),ISNUMBER(FIND($I10,$H$52))),1,0)+IF(AND(ISNUMBER(FIND(L$8,$H$53)),ISNUMBER(FIND($I10,$H$53))),1,0)+IF(AND(ISNUMBER(FIND(L$8,$H$54)),ISNUMBER(FIND($I10,$H$54))),1,0)+IF(AND(ISNUMBER(FIND(L$8,$H$55)),ISNUMBER(FIND($I10,$H$55))),1,0)+IF(AND(ISNUMBER(FIND(L$8,$H$56)),ISNUMBER(FIND($I10,$H$56))),1,0)+IF(AND(ISNUMBER(FIND(L$8,$H$57)),ISNUMBER(FIND($I10,$H$57))),1,0)+IF(AND(ISNUMBER(FIND(L$8,$H$58)),ISNUMBER(FIND($I10,$H$58))),1,0)+IF(AND(ISNUMBER(FIND(L$8,$H$59)),ISNUMBER(FIND($I10,$H$59))),1,0)+IF(AND(ISNUMBER(FIND(L$8,$H$60)),ISNUMBER(FIND($I10,$H$60))),1,0)+IF(AND(ISNUMBER(FIND(L$8,$H$61)),ISNUMBER(FIND($I10,$H$61))),1,0)+IF(AND(ISNUMBER(FIND(L$8,$H$62)),ISNUMBER(FIND($I10,$H$62))),1,0)+IF(AND(ISNUMBER(FIND(L$8,$H$63)),ISNUMBER(FIND($I10,$H$63))),1,0)+IF(AND(ISNUMBER(FIND(L$8,$H$64)),ISNUMBER(FIND($I10,$H$64))),1,0)+IF(AND(ISNUMBER(FIND(L$8,$H$65)),ISNUMBER(FIND($I10,$H$65))),1,0)+IF(AND(ISNUMBER(FIND(L$8,$H$66)),ISNUMBER(FIND($I10,$H$66))),1,0)+IF(AND(ISNUMBER(FIND(L$8,$H$67)),ISNUMBER(FIND($I10,$H$67))),1,0)+IF(AND(ISNUMBER(FIND(L$8,$H$68)),ISNUMBER(FIND($I10,$H$68))),1,0)+IF(AND(ISNUMBER(FIND(L$8,$H$69)),ISNUMBER(FIND($I10,$H$69))),1,0)+IF(AND(ISNUMBER(FIND(L$8,$H$70)),ISNUMBER(FIND($I10,$H$70))),1,0)+IF(AND(ISNUMBER(FIND(L$8,$H$71)),ISNUMBER(FIND($I10,$H$71))),1,0)+IF(AND(ISNUMBER(FIND(L$8,$H$72)),ISNUMBER(FIND($I10,$H$72))),1,0)+IF(AND(ISNUMBER(FIND(L$8,$H$73)),ISNUMBER(FIND($I10,$H$73))),1,0)+IF(AND(ISNUMBER(FIND(L$8,$H$74)),ISNUMBER(FIND($I10,$H$74))),1,0)+IF(AND(ISNUMBER(FIND(L$8,$H$75)),ISNUMBER(FIND($I10,$H$75))),1,0)+IF(AND(ISNUMBER(FIND(L$8,$H$76)),ISNUMBER(FIND($I10,$H$76))),1,0)","v":4},4,5,4,4,5,5,4,3,5,5,5,3,5,4,4]
{"$rows_left_out":67}
{"sheet":"Bron","index":3,"n_rows":46,"n_cols":16,"rows_kept":46,"cut":false,"hidden":false,"merged":[]}
["Race","Boot 1","Boot 2","Boot 3","Boot 4","Boot 5","Boot 6",null,"Wer segelt wie oft auf Boot x"]
[1.0,11.0,8.0,13.0,12.0,15.0,3.0,null,"Team","Boot 1","Boot 2","Boot 3","Boot 4","Boot 5","Boot 6","Total"]
[2.0,2.0,17.0,1.0,9.0,4.0,10.0,6.0,1.0,{"$f":"COUNTIF(B:B,$I3)","v":2},1,1,4,4,3,{"$f":"SUM(J3:O3)","v":15}]
[3.0,7.0,6.0,16.0,14.0,18.0,5.0,4.0,2.0,{"$f":"COUNTIF(B:B,$I4)","v":1},3,2,4,3,2,15]
[4.0,7.0,3.0,2.0,11.0,18.0,1.0,6.0,3.0,{"$f":"COUNTIF(B:B,$I5)","v":3},3,3,2,2,2,15]
[5.0,12.0,13.0,14.0,4.0,9.0,16.0,6.0,4.0,{"$f":"COUNTIF(B:B,$I6)","v":1},4,2,3,3,2,15]
[6.0,10.0,5.0,6.0,17.0,8.0,15.0,4.0,5.0,{"$f":"COUNTIF(B:B,$I7)","v":3},3,2,2,3,2,15]
[7.0,13.0,5.0,6.0,3.0,2.0,9.0,6.0,6.0,{"$f":"COUNTIF(B:B,$I8)","v":3},3,3,3,1,2,15]
[8.0,11.0,4.0,15.0,7.0,14.0,17.0,6.0,7.0,{"$f":"COUNTIF(B:B,$I9)","v":4},3,3,3,1,1,15]
[9.0,18.0,12.0,10.0,8.0,1.0,16.0,4.0,8.0,{"$f":"COUNTIF(B:B,$I10)","v":1},4,3,3,3,1,15]
{"$rows_left_out":36}